{"text_format":"3","workbook":"xlsx","n_sheets":4,"sheets":["výsledky","prezence","počet kol","LCD"],"not_rendered":{"images":1,"macros":1},"read":"whole","date_system":"1900"}

{"sheet":"výsledky","index":0,"n_rows":205,"n_cols":10,"rows_kept":205}
["Louny - Olympijský běh, 21.6. 2023",{"$nulls":8},"Do sloupce B se proklikávají výsledné časy (Ctrl+Z/Y)"]
[{"$nulls":3},{"$f":"COUNTA(prezence!A:A)-1","v":41},"registrovaných",{"$nulls":4},"Do sloupce D zapiš startovní číslo"]
[{"$nulls":9},"Tlačítko Start = Ctrl+m (pozor vymaže všechny dosažené časy)"]
["Start",45098.74998842592]
["Poř.","Čas","Ztráta","St. č.","Příjmení","Jméno","Nar.","Klub","Kategorie"]
[1,"00:17:10","-",20,{"$f":"IFERROR(VLOOKUP($D6,prezence!A:F,2,0),\"\")","v":"Huja"},{"$f":"IFERROR(VLOOKUP($D6,prezence!A:F,3,0),\"\")","v":"Vitezslav"},{"$f":"IFERROR(VLOOKUP($D6,prezence!A:F,4,0),\"\")","v":1987},{"$f":"IFERROR(VLOOKUP($D6,prezence!A:F,5,0),\"\")","v":"Vitezslav"},{"$f":"IFERROR(VLOOKUP($D6,prezence!A:F,6,0),\"\")","v":0}]
[2,"00:17:32",{"$f":"B7-$B$6","v":"00:00:22"},10,{"$f":"IFERROR(VLOOKUP($D7,prezence!A:F,2,0),\"\")","v":"Reiner"},{"$f":"IFERROR(VLOOKUP($D7,prezence!A:F,3,0),\"\")","v":"Lukáš"},{"$f":"IFERROR(VLOOKUP($D7,prezence!A:F,4,0),\"\")","v":1980},{"$f":"IFERROR(VLOOKUP($D7,prezence!A:F,5,0),\"\")","v":"Lukáš"},{"$f":"IFERROR(VLOOKUP($D7,prezence!A:F,6,0),\"\")","v":0}]
[3,"00:17:41","00:00:31",14,{"$f":"IFERROR(VLOOKUP($D8,prezence!A:F,2,0),\"\")","v":"Karasová"},{"$f":"IFERROR(VLOOKUP($D8,prezence!A:F,3,0),\"\")","v":"Anna"},{"$f":"IFERROR(VLOOKUP($D8,prezence!A:F,4,0),\"\")","v":1984},{"$f":"IFERROR(VLOOKUP($D8,prezence!A:F,5,0),\"\")","v":"Anna"},{"$f":"IFERROR(VLOOKUP($D8,prezence!A:F,6,0),\"\")","v":0}]
[4,"00:18:56","00:01:46",27,{"$f":"IFERROR(VLOOKUP($D9,prezence!A:F,2,0),\"\")","v":"Gaube"},{"$f":"IFERROR(VLOOKUP($D9,prezence!A:F,3,0),\"\")","v":"Jitka"},{"$f":"IFERROR(VLOOKUP($D9,prezence!A:F,4,0),\"\")","v":1983},{"$f":"IFERROR(VLOOKUP($D9,prezence!A:F,5,0),\"\")","v":"Jíťa"},{"$f":"IFERROR(VLOOKUP($D9,prezence!A:F,6,0),\"\")","v":0}]
[5,"00:19:23","00:02:13",37,{"$f":"IFERROR(VLOOKUP($D10,prezence!A:F,2,0),\"\")","v":"Kosina"},{"$f":"IFERROR(VLOOKUP($D10,prezence!A:F,3,0),\"\")","v":"Jakub"},{"$f":"IFERROR(VLOOKUP($D10,prezence!A:F,4,0),\"\")","v":1990},{"$f":"IFERROR(VLOOKUP($D10,prezence!A:F,5,0),\"\")","v":"Jakub"},{"$f":"IFERROR(VLOOKUP($D10,prezence!A:F,6,0),\"\")","v":0}]
[6,"00:19:35","00:02:25",13,{"$f":"IFERROR(VLOOKUP($D11,prezence!A:F,2,0),\"\")","v":"Burianová"},{"$f":"IFERROR(VLOOKUP($D11,prezence!A:F,3,0),\"\")","v":"Denisa"},{"$f":"IFERROR(VLOOKUP($D11,prezence!A:F,4,0),\"\")","v":1993},{"$f":"IFERROR(VLOOKUP($D11,prezence!A:F,5,0),\"\")","v":"Denda"},{"$f":"IFERROR(VLOOKUP($D11,prezence!A:F,6,0),\"\")","v":0}]
[7,"00:20:07",{"$f":"B12-$B$6","v":"00:02:57"},34,{"$f":"IFERROR(VLOOKUP($D12,prezence!A:F,2,0),\"\")","v":"Odvárka"},{"$f":"IFERROR(VLOOKUP($D12,prezence!A:F,3,0),\"\")","v":"Lukáš"},{"$f":"IFERROR(VLOOKUP($D12,prezence!A:F,4,0),\"\")","v":1985},{"$f":"IFERROR(VLOOKUP($D12,prezence!A:F,5,0),\"\")","v":"Lukáš"},{"$f":"IFERROR(VLOOKUP($D12,prezence!A:F,6,0),\"\")","v":0}]
[8,"00:20:21","00:03:11",33,{"$f":"IFERROR(VLOOKUP($D13,prezence!A:F,2,0),\"\")","v":"Petrmichl"},{"$f":"IFERROR(VLOOKUP($D13,prezence!A:F,3,0),\"\")","v":"Vít"},{"$f":"IFERROR(VLOOKUP($D13,prezence!A:F,4,0),\"\")","v":1987},{"$f":"IFERROR(VLOOKUP($D13,prezence!A:F,5,0),\"\")","v":"Vít"},{"$f":"IFERROR(VLOOKUP($D13,prezence!A:F,6,0),\"\")","v":0}]
[9,"00:20:24","00:03:14",39,{"$f":"IFERROR(VLOOKUP($D14,prezence!A:F,2,0),\"\")","v":"Pásztor"},{"$f":"IFERROR(VLOOKUP($D14,prezence!A:F,3,0),\"\")","v":"Michal"},{"$f":"IFERROR(VLOOKUP($D14,prezence!A:F,4,0),\"\")","v":1981},{"$f":"IFERROR(VLOOKUP($D14,prezence!A:F,5,0),\"\")","v":"Michal"},{"$f":"IFERROR(VLOOKUP($D14,prezence!A:F,6,0),\"\")","v":0}]
[10,"00:20:26","00:03:16",15,{"$f":"IFERROR(VLOOKUP($D15,prezence!A:F,2,0),\"\")","v":"Karas"},{"$f":"IFERROR(VLOOKUP($D15,prezence!A:F,3,0),\"\")","v":"Václav"},{"$f":"IFERROR(VLOOKUP($D15,prezence!A:F,4,0),\"\")","v":1980},{"$f":"IFERROR(VLOOKUP($D15,prezence!A:F,5,0),\"\")","v":"Václav"},{"$f":"IFERROR(VLOOKUP($D15,prezence!A:F,6,0),\"\")","v":0}]
[11,"00:20:59","00:03:49",17,{"$f":"IFERROR(VLOOKUP($D16,prezence!A:F,2,0),\"\")","v":"Sainer"},{"$f":"IFERROR(VLOOKUP($D16,prezence!A:F,3,0),\"\")","v":"Jiri"},{"$f":"IFERROR(VLOOKUP($D16,prezence!A:F,4,0),\"\")","v":1983},{"$f":"IFERROR(VLOOKUP($D16,prezence!A:F,5,0),\"\")","v":"Sainy"},{"$f":"IFERROR(VLOOKUP($D16,prezence!A:F,6,0),\"\")","v":0}]
[12,"00:21:11","00:04:01",6,{"$f":"IFERROR(VLOOKUP($D17,prezence!A:F,2,0),\"\")","v":"Riedl"},{"$f":"IFERROR(VLOOKUP($D17,prezence!A:F,3,0),\"\")","v":"Lukas"},{"$f":"IFERROR(VLOOKUP($D17,prezence!A:F,4,0),\"\")","v":1983},{"$f":"IFERROR(VLOOKUP($D17,prezence!A:F,5,0),\"\")","v":"PEKY"},{"$f":"IFERROR(VLOOKUP($D17,prezence!A:F,6,0),\"\")","v":0}]
[13,"00:21:27","00:04:17",26,{"$f":"IFERROR(VLOOKUP($D18,prezence!A:F,2,0),\"\")","v":"Kusý"},{"$f":"IFERROR(VLOOKUP($D18,prezence!A:F,3,0),\"\")","v":"Jan"},{"$f":"IFERROR(VLOOKUP($D18,prezence!A:F,4,0),\"\")","v":1974},{"$f":"IFERROR(VLOOKUP($D18,prezence!A:F,5,0),\"\")","v":"kusič"},{"$f":"IFERROR(VLOOKUP($D18,prezence!A:F,6,0),\"\")","v":0}]
[14,"00:21:31","00:04:21",19,{"$f":"IFERROR(VLOOKUP($D19,prezence!A:F,2,0),\"\")","v":"Sejvalová"},{"$f":"IFERROR(VLOOKUP($D19,prezence!A:F,3,0),\"\")","v":"Veronika"},{"$f":"IFERROR(VLOOKUP($D19,prezence!A:F,4,0),\"\")","v":1986},{"$f":"IFERROR(VLOOKUP($D19,prezence!A:F,5,0),\"\")","v":"Veronika"},{"$f":"IFERROR(VLOOKUP($D19,prezence!A:F,6,0),\"\")","v":0}]
[15,"00:21:37","00:04:27",9,{"$f":"IFERROR(VLOOKUP($D20,prezence!A:F,2,0),\"\")","v":"Macháčková"},{"$f":"IFERROR(VLOOKUP($D20,prezence!A:F,3,0),\"\")","v":"Michaela"},{"$f":"IFERROR(VLOOKUP($D20,prezence!A:F,4,0),\"\")","v":1980},{"$f":"IFERROR(VLOOKUP($D20,prezence!A:F,5,0),\"\")","v":"Michaela"},{"$f":"IFERROR(VLOOKUP($D20,prezence!A:F,6,0),\"\")","v":0}]
[16,"00:21:54","00:04:44",1,{"$f":"IFERROR(VLOOKUP($D21,prezence!A:F,2,0),\"\")","v":"Müller"},{"$f":"IFERROR(VLOOKUP($D21,prezence!A:F,3,0),\"\")","v":"Josef"},{"$f":"IFERROR(VLOOKUP($D21,prezence!A:F,4,0),\"\")","v":1974},{"$f":"IFERROR(VLOOKUP($D21,prezence!A:F,5,0),\"\")","v":"PEPINO"},{"$f":"IFERROR(VLOOKUP($D21,prezence!A:F,6,0),\"\")","v":0}]
[17,"00:22:36","00:05:26",7,{"$f":"IFERROR(VLOOKUP($D22,prezence!A:F,2,0),\"\")","v":"Horská"},{"$f":"IFERROR(VLOOKUP($D22,prezence!A:F,3,0),\"\")","v":"Kateřina"},{"$f":"IFERROR(VLOOKUP($D22,prezence!A:F,4,0),\"\")","v":1991},{"$f":"IFERROR(VLOOKUP($D22,prezence!A:F,5,0),\"\")","v":"Khaty"},{"$f":"IFERROR(VLOOKUP($D22,prezence!A:F,6,0),\"\")","v":0}]
[18,"00:23:00","00:05:50",8,{"$f":"IFERROR(VLOOKUP($D23,prezence!A:F,2,0),\"\")","v":"Deverová"},{"$f":"IFERROR(VLOOKUP($D23,prezence!A:F,3,0),\"\")","v":"Lenka"},{"$f":"IFERROR(VLOOKUP($D23,prezence!A:F,4,0),\"\")","v":1992},{"$f":"IFERROR(VLOOKUP($D23,prezence!A:F,5,0),\"\")","v":"Deverka"},{"$f":"IFERROR(VLOOKUP($D23,prezence!A:F,6,0),\"\")","v":0}]
[19,"00:23:12","00:06:02",31,{"$f":"IFERROR(VLOOKUP($D24,prezence!A:F,2,0),\"\")","v":"Klánová"},{"$f":"IFERROR(VLOOKUP($D24,prezence!A:F,3,0),\"\")","v":"Michaela"},{"$f":"IFERROR(VLOOKUP($D24,prezence!A:F,4,0),\"\")","v":1991},{"$f":"IFERROR(VLOOKUP($D24,prezence!A:F,5,0),\"\")","v":"Michaela"},{"$f":"IFERROR(VLOOKUP($D24,prezence!A:F,6,0),\"\")","v":0}]
[20,"00:23:12","00:06:02",35,{"$f":"IFERROR(VLOOKUP($D25,prezence!A:F,2,0),\"\")","v":"Světlý"},{"$f":"IFERROR(VLOOKUP($D25,prezence!A:F,3,0),\"\")","v":"Ondřej"},{"$f":"IFERROR(VLOOKUP($D25,prezence!A:F,4,0),\"\")","v":1979},{"$f":"IFERROR(VLOOKUP($D25,prezence!A:F,5,0),\"\")","v":"Ondřej"},{"$f":"IFERROR(VLOOKUP($D25,prezence!A:F,6,0),\"\")","v":0}]
[21,"00:23:49","00:06:39",41,{"$f":"IFERROR(VLOOKUP($D26,prezence!A:F,2,0),\"\")","v":"Sedláčková"},{"$f":"IFERROR(VLOOKUP($D26,prezence!A:F,3,0),\"\")","v":"Petra"},{"$f":"IFERROR(VLOOKUP($D26,prezence!A:F,4,0),\"\")","v":1993},{"$f":"IFERROR(VLOOKUP($D26,prezence!A:F,5,0),\"\")","v":"Petra"},{"$f":"IFERROR(VLOOKUP($D26,prezence!A:F,6,0),\"\")","v":0}]
[22,"00:23:49","00:06:39",43,{"$f":"IFERROR(VLOOKUP($D27,prezence!A:F,2,0),\"\")","v":"Honka"},{"$f":"IFERROR(VLOOKUP($D27,prezence!A:F,3,0),\"\")","v":"Adela"},{"$f":"IFERROR(VLOOKUP($D27,prezence!A:F,4,0),\"\")","v":1994},{"$f":"IFERROR(VLOOKUP($D27,prezence!A:F,5,0),\"\")","v":"Adela"},{"$f":"IFERROR(VLOOKUP($D27,prezence!A:F,6,0),\"\")","v":0}]
[23,"00:24:06","00:06:56",30,{"$f":"IFERROR(VLOOKUP($D28,prezence!A:F,2,0),\"\")","v":"Charvátová"},{"$f":"IFERROR(VLOOKUP($D28,prezence!A:F,3,0),\"\")","v":"Michaela"},{"$f":"IFERROR(VLOOKUP($D28,prezence!A:F,4,0),\"\")","v":1991},{"$f":"IFERROR(VLOOKUP($D28,prezence!A:F,5,0),\"\")","v":"Michaela"},{"$f":"IFERROR(VLOOKUP($D28,prezence!A:F,6,0),\"\")","v":0}]
[24,"00:24:10","00:07:00",23,{"$f":"IFERROR(VLOOKUP($D29,prezence!A:F,2,0),\"\")","v":"Lukšík"},{"$f":"IFERROR(VLOOKUP($D29,prezence!A:F,3,0),\"\")","v":"Václav"},{"$f":"IFERROR(VLOOKUP($D29,prezence!A:F,4,0),\"\")","v":1977},{"$f":"IFERROR(VLOOKUP($D29,prezence!A:F,5,0),\"\")","v":"Čáryfuk"},{"$f":"IFERROR(VLOOKUP($D29,prezence!A:F,6,0),\"\")","v":0}]
[25,"00:24:16","00:07:06",25,{"$f":"IFERROR(VLOOKUP($D30,prezence!A:F,2,0),\"\")","v":"Kusá"},{"$f":"IFERROR(VLOOKUP($D30,prezence!A:F,3,0),\"\")","v":"Lenka"},{"$f":"IFERROR(VLOOKUP($D30,prezence!A:F,4,0),\"\")","v":1973},{"$f":"IFERROR(VLOOKUP($D30,prezence!A:F,5,0),\"\")","v":"kusička"},{"$f":"IFERROR(VLOOKUP($D30,prezence!A:F,6,0),\"\")","v":0}]
{"$rows_left_out":176}
{"sheet":"prezence","index":1,"n_rows":44,"n_cols":12,"rows_kept":44}
["st.č.","Příjmení","Jméno","r.n.","Klub","Kategorie",null,"Startovní číslo","Jméno","Příjmení","Pohlaví","Přezdívka"]
[1,"Müller","Josef",1974,"PEPINO",{"$nulls":3},"Samuel","Pásztor","muž",2014]
[2,"Peštová","Jana",1980,"TÉRA",{"$nulls":3},"Antonín","Šedivý","muž",2020]
[3,"Rohlová","Jitka",1981,"Jitka",{"$nulls":3},"Petr","Kulíšek","muž",2013]
[4,"Sejvalová","Petra",1978,"Peťuška",{"$nulls":3},"Jaroslav","Sedláček","muž",2021]
[5,"Gavelčík","Tomáš",1985,"Tomáš",{"$nulls":3},"Matyáš","Trubač","muž",2013]
[6,"Riedl","Lukas",1983,"PEKY",{"$nulls":3},"Tomáš","Trubač","muž",2011]
[7,"Horská","Kateřina",1991,"Khaty",{"$nulls":3},"Marek","Vaja","muž",2009]
[8,"Deverová","Lenka",1992,"Deverka",{"$nulls":3},"Vojtěch","Odvárka","muž",2014]
[9,"Macháčková","Michaela",1980,"Michaela",{"$nulls":3},"Tomáš","Formánek","muž",2014]
[10,"Reiner","Lukáš",1980,"Lukáš",{"$nulls":3},"Jan","Formánek","muž",2011]
[11,"Rousova","Julie",1999,"Julie",{"$nulls":3},"Anežka","Formánková","žena",2016]
[12,"Rousova","Lucie",2002,"Lucie",{"$nulls":3},"Jiřina","Formánková","žena",2013]
[13,"Burianová","Denisa",1993,"Denda",{"$nulls":3},"Ondřej","Světlý","muž",2020]
[14,"Karasová","Anna",1984,"Anna",{"$nulls":3},"Tina","Riedlová","žena",2014]
[15,"Karas","Václav",1980,"Václav",{"$nulls":3},"Daniel","Křivan","muž",2017]
[16,"Sainerova","Kamila",1986,"Kamila",{"$nulls":3},"Vojtěch","Devera","muž",2015]
[17,"Sainer","Jiri",1983,"Sainy",{"$nulls":3},"Martin","Kunz","muž",2008]
[18,"Sejval","Jan",1979,"Jan",{"$nulls":3},"Marek","Kudry","muž",2013]
[19,"Sejvalová","Veronika",1986,"Veronika",{"$nulls":3},"Nikol","Kudryová","žena",2012]
[20,"Huja","Vitezslav",1987,"Vitezslav",{"$nulls":3},"Filip","Vejlupek","muž",2017]
[21,"Urbanová","Jaroslava",1964,"Jaroslava",{"$nulls":3},"Jiri","Sainer","muž",2011]
[22,"Vitovský","Petr",1964,"Cukrar",{"$nulls":3},"Šimon","Sainer","muž",2016]
[23,"Lukšík","Václav",1977,"Čáryfuk",{"$nulls":3},"Valerie","Sejvalová","žena",2019]
[null,"Horna","Tereza",1995,"Tereza",{"$nulls":3},"Michal","Veihand","muž",2013]
[25,"Kusá","Lenka",1973,"kusička",{"$nulls":3},"Jiří","Zach","muž",2009]
[26,"Kusý","Jan",1974,"kusič",{"$nulls":3},"Metoděj","Rohla","muž",2012]
[27,"Gaube","Jitka",1983,"Jíťa"]
[28,"RŮŽIČKA","PAVEL",1964,"PAVEL"]
[null,"Gabrielová","Lucie",1977,"Lucie"]
{"$rows_left_out":15}
{"sheet":"počet kol","index":2,"n_rows":11,"n_cols":8,"rows_kept":11}
["St. č.","Příjmení","Jméno","Nar.","Klub","Kategorie","uběhnuto","zbývá"]
[1,{"$f":"IFERROR(VLOOKUP($A2,prezence!A:F,2,0),\"\")","v":"Müller"},{"$f":"IFERROR(VLOOKUP($A2,prezence!A:F,3,0),\"\")","v":"Josef"},{"$f":"IFERROR(VLOOKUP($A2,prezence!A:F,4,0),\"\")","v":1974},{"$f":"IFERROR(VLOOKUP($A2,prezence!A:F,5,0),\"\")","v":"PEPINO"},{"$f":"IFERROR(VLOOKUP($A2,prezence!A:F,6,0),\"\")","v":0},{"$f":"COUNTIF(výsledky!D6:D3000,A2)","v":1},{"$f":"43-G2","v":42}]
[2,{"$f":"IFERROR(VLOOKUP($A3,prezence!A:F,2,0),\"\")","v":"Peštová"},{"$f":"IFERROR(VLOOKUP($A3,prezence!A:F,3,0),\"\")","v":"Jana"},{"$f":"IFERROR(VLOOKUP($A3,prezence!A:F,4,0),\"\")","v":1980},{"$f":"IFERROR(VLOOKUP($A3,prezence!A:F,5,0),\"\")","v":"TÉRA"},{"$f":"IFERROR(VLOOKUP($A3,prezence!A:F,6,0),\"\")","v":0},{"$f":"COUNTIF(výsledky!D7:D3001,A3)","v":1},{"$f":"43-G3","v":42}]
[3,{"$f":"IFERROR(VLOOKUP($A4,prezence!A:F,2,0),\"\")","v":"Rohlová"},{"$f":"IFERROR(VLOOKUP($A4,prezence!A:F,3,0),\"\")","v":"Jitka"},{"$f":"IFERROR(VLOOKUP($A4,prezence!A:F,4,0),\"\")","v":1981},{"$f":"IFERROR(VLOOKUP($A4,prezence!A:F,5,0),\"\")","v":"Jitka"},{"$f":"IFERROR(VLOOKUP($A4,prezence!A:F,6,0),\"\")","v":0},{"$f":"COUNTIF(výsledky!D8:D3002,A4)","v":0},43]
[4,{"$f":"IFERROR(VLOOKUP($A5,prezence!A:F,2,0),\"\")","v":"Sejvalová"},{"$f":"IFERROR(VLOOKUP($A5,prezence!A:F,3,0),\"\")","v":"Petra"},{"$f":"IFERROR(VLOOKUP($A5,prezence!A:F,4,0),\"\")","v":1978},{"$f":"IFERROR(VLOOKUP($A5,prezence!A:F,5,0),\"\")","v":"Peťuška"},{"$f":"IFERROR(VLOOKUP($A5,prezence!A:F,6,0),\"\")","v":0},{"$f":"COUNTIF(výsledky!D9:D3003,A5)","v":1},42]
[5,{"$f":"IFERROR(VLOOKUP($A6,prezence!A:F,2,0),\"\")","v":"Gavelčík"},{"$f":"IFERROR(VLOOKUP($A6,prezence!A:F,3,0),\"\")","v":"Tomáš"},{"$f":"IFERROR(VLOOKUP($A6,prezence!A:F,4,0),\"\")","v":1985},{"$f":"IFERROR(VLOOKUP($A6,prezence!A:F,5,0),\"\")","v":"Tomáš"},{"$f":"IFERROR(VLOOKUP($A6,prezence!A:F,6,0),\"\")","v":0},{"$f":"COUNTIF(výsledky!D10:D3004,A6)","v":1},42]
[6,{"$f":"IFERROR(VLOOKUP($A7,prezence!A:F,2,0),\"\")","v":"Riedl"},{"$f":"IFERROR(VLOOKUP($A7,prezence!A:F,3,0),\"\")","v":"Lukas"},{"$f":"IFERROR(VLOOKUP($A7,prezence!A:F,4,0),\"\")","v":1983},{"$f":"IFERROR(VLOOKUP($A7,prezence!A:F,5,0),\"\")","v":"PEKY"},{"$f":"IFERROR(VLOOKUP($A7,prezence!A:F,6,0),\"\")","v":0},{"$f":"COUNTIF(výsledky!D11:D3005,A7)","v":1},42]
[7,{"$f":"IFERROR(VLOOKUP($A8,prezence!A:F,2,0),\"\")","v":"Horská"},{"$f":"IFERROR(VLOOKUP($A8,prezence!A:F,3,0),\"\")","v":"Kateřina"},{"$f":"IFERROR(VLOOKUP($A8,prezence!A:F,4,0),\"\")","v":1991},{"$f":"IFERROR(VLOOKUP($A8,prezence!A:F,5,0),\"\")","v":"Khaty"},{"$f":"IFERROR(VLOOKUP($A8,prezence!A:F,6,0),\"\")","v":0},{"$f":"COUNTIF(výsledky!D12:D3006,A8)","v":1},42]
[{"$nulls":6},"1. okruh"]
[{"$nulls":6},"měří"]
[{"$nulls":6},"981,29 m"]

{"sheet":"LCD","index":3,"n_rows":201,"n_cols":7,"rows_kept":201}
["Poř.","Čas","Ztráta","St. č.","Příjmení","Jméno","Nar."]
[1,{"$f":"výsledky!B6","v":"00:17:10"},"-",{"$f":"výsledky!D6","v":20},{"$f":"IFERROR(VLOOKUP($D2,prezence!A:F,2,0),\"\")","v":"Huja"},{"$f":"IFERROR(VLOOKUP($D2,prezence!A:F,3,0),\"\")","v":"Vitezslav"},{"$f":"IFERROR(VLOOKUP($D2,prezence!A:F,4,0),\"\")","v":1987}]
[2,{"$f":"výsledky!B7","v":"00:17:32"},{"$f":"výsledky!C7","v":"00:00:22"},{"$f":"výsledky!D7","v":10},{"$f":"IFERROR(VLOOKUP($D3,prezence!A:F,2,0),\"\")","v":"Reiner"},{"$f":"IFERROR(VLOOKUP($D3,prezence!A:F,3,0),\"\")","v":"Lukáš"},{"$f":"IFERROR(VLOOKUP($D3,prezence!A:F,4,0),\"\")","v":1980}]
[3,{"$f":"výsledky!B8","v":"00:17:41"},{"$f":"výsledky!C8","v":"00:00:31"},{"$f":"výsledky!D8","v":14},{"$f":"IFERROR(VLOOKUP($D4,prezence!A:F,2,0),\"\")","v":"Karasová"},{"$f":"IFERROR(VLOOKUP($D4,prezence!A:F,3,0),\"\")","v":"Anna"},{"$f":"IFERROR(VLOOKUP($D4,prezence!A:F,4,0),\"\")","v":1984}]
[4,{"$f":"výsledky!B9","v":"00:18:56"},{"$f":"výsledky!C9","v":"00:01:46"},{"$f":"výsledky!D9","v":27},{"$f":"IFERROR(VLOOKUP($D5,prezence!A:F,2,0),\"\")","v":"Gaube"},{"$f":"IFERROR(VLOOKUP($D5,prezence!A:F,3,0),\"\")","v":"Jitka"},{"$f":"IFERROR(VLOOKUP($D5,prezence!A:F,4,0),\"\")","v":1983}]
[5,{"$f":"výsledky!B10","v":"00:19:23"},{"$f":"výsledky!C10","v":"00:02:13"},{"$f":"výsledky!D10","v":37},{"$f":"IFERROR(VLOOKUP($D6,prezence!A:F,2,0),\"\")","v":"Kosina"},{"$f":"IFERROR(VLOOKUP($D6,prezence!A:F,3,0),\"\")","v":"Jakub"},{"$f":"IFERROR(VLOOKUP($D6,prezence!A:F,4,0),\"\")","v":1990}]
[6,{"$f":"výsledky!B11","v":"00:19:35"},{"$f":"výsledky!C11","v":"00:02:25"},{"$f":"výsledky!D11","v":13},{"$f":"IFERROR(VLOOKUP($D7,prezence!A:F,2,0),\"\")","v":"Burianová"},{"$f":"IFERROR(VLOOKUP($D7,prezence!A:F,3,0),\"\")","v":"Denisa"},{"$f":"IFERROR(VLOOKUP($D7,prezence!A:F,4,0),\"\")","v":1993}]
[7,{"$f":"výsledky!B12","v":"00:20:07"},{"$f":"výsledky!C12","v":"00:02:57"},{"$f":"výsledky!D12","v":34},{"$f":"IFERROR(VLOOKUP($D8,prezence!A:F,2,0),\"\")","v":"Odvárka"},{"$f":"IFERROR(VLOOKUP($D8,prezence!A:F,3,0),\"\")","v":"Lukáš"},{"$f":"IFERROR(VLOOKUP($D8,prezence!A:F,4,0),\"\")","v":1985}]
[8,{"$f":"výsledky!B13","v":"00:20:21"},{"$f":"výsledky!C13","v":"00:03:11"},{"$f":"výsledky!D13","v":33},{"$f":"IFERROR(VLOOKUP($D9,prezence!A:F,2,0),\"\")","v":"Petrmichl"},{"$f":"IFERROR(VLOOKUP($D9,prezence!A:F,3,0),\"\")","v":"Vít"},{"$f":"IFERROR(VLOOKUP($D9,prezence!A:F,4,0),\"\")","v":1987}]
[9,{"$f":"výsledky!B14","v":"00:20:24"},{"$f":"výsledky!C14","v":"00:03:14"},{"$f":"výsledky!D14","v":39},{"$f":"IFERROR(VLOOKUP($D10,prezence!A:F,2,0),\"\")","v":"Pásztor"},{"$f":"IFERROR(VLOOKUP($D10,prezence!A:F,3,0),\"\")","v":"Michal"},{"$f":"IFERROR(VLOOKUP($D10,prezence!A:F,4,0),\"\")","v":1981}]
[10,{"$f":"výsledky!B15","v":"00:20:26"},{"$f":"výsledky!C15","v":"00:03:16"},{"$f":"výsledky!D15","v":15},{"$f":"IFERROR(VLOOKUP($D11,prezence!A:F,2,0),\"\")","v":"Karas"},{"$f":"IFERROR(VLOOKUP($D11,prezence!A:F,3,0),\"\")","v":"Václav"},{"$f":"IFERROR(VLOOKUP($D11,prezence!A:F,4,0),\"\")","v":1980}]
[11,{"$f":"výsledky!B16","v":"00:20:59"},{"$f":"výsledky!C16","v":"00:03:49"},{"$f":"výsledky!D16","v":17},{"$f":"IFERROR(VLOOKUP($D12,prezence!A:F,2,0),\"\")","v":"Sainer"},{"$f":"IFERROR(VLOOKUP($D12,prezence!A:F,3,0),\"\")","v":"Jiri"},{"$f":"IFERROR(VLOOKUP($D12,prezence!A:F,4,0),\"\")","v":1983}]
[12,{"$f":"výsledky!B17","v":"00:21:11"},{"$f":"výsledky!C17","v":"00:04:01"},{"$f":"výsledky!D17","v":6},{"$f":"IFERROR(VLOOKUP($D13,prezence!A:F,2,0),\"\")","v":"Riedl"},{"$f":"IFERROR(VLOOKUP($D13,prezence!A:F,3,0),\"\")","v":"Lukas"},{"$f":"IFERROR(VLOOKUP($D13,prezence!A:F,4,0),\"\")","v":1983}]
[13,{"$f":"výsledky!B18","v":"00:21:27"},{"$f":"výsledky!C18","v":"00:04:17"},{"$f":"výsledky!D18","v":26},{"$f":"IFERROR(VLOOKUP($D14,prezence!A:F,2,0),\"\")","v":"Kusý"},{"$f":"IFERROR(VLOOKUP($D14,prezence!A:F,3,0),\"\")","v":"Jan"},{"$f":"IFERROR(VLOOKUP($D14,prezence!A:F,4,0),\"\")","v":1974}]
[14,{"$f":"výsledky!B19","v":"00:21:31"},{"$f":"výsledky!C19","v":"00:04:21"},{"$f":"výsledky!D19","v":19},{"$f":"IFERROR(VLOOKUP($D15,prezence!A:F,2,0),\"\")","v":"Sejvalová"},{"$f":"IFERROR(VLOOKUP($D15,prezence!A:F,3,0),\"\")","v":"Veronika"},{"$f":"IFERROR(VLOOKUP($D15,prezence!A:F,4,0),\"\")","v":1986}]
[15,{"$f":"výsledky!B20","v":"00:21:37"},{"$f":"výsledky!C20","v":"00:04:27"},{"$f":"výsledky!D20","v":9},{"$f":"IFERROR(VLOOKUP($D16,prezence!A:F,2,0),\"\")","v":"Macháčková"},{"$f":"IFERROR(VLOOKUP($D16,prezence!A:F,3,0),\"\")","v":"Michaela"},{"$f":"IFERROR(VLOOKUP($D16,prezence!A:F,4,0),\"\")","v":1980}]
[16,{"$f":"výsledky!B21","v":"00:21:54"},{"$f":"výsledky!C21","v":"00:04:44"},{"$f":"výsledky!D21","v":1},{"$f":"IFERROR(VLOOKUP($D17,prezence!A:F,2,0),\"\")","v":"Müller"},{"$f":"IFERROR(VLOOKUP($D17,prezence!A:F,3,0),\"\")","v":"Josef"},{"$f":"IFERROR(VLOOKUP($D17,prezence!A:F,4,0),\"\")","v":1974}]
[17,{"$f":"výsledky!B22","v":"00:22:36"},{"$f":"výsledky!C22","v":"00:05:26"},{"$f":"výsledky!D22","v":7},{"$f":"IFERROR(VLOOKUP($D18,prezence!A:F,2,0),\"\")","v":"Horská"},{"$f":"IFERROR(VLOOKUP($D18,prezence!A:F,3,0),\"\")","v":"Kateřina"},{"$f":"IFERROR(VLOOKUP($D18,prezence!A:F,4,0),\"\")","v":1991}]
[18,{"$f":"výsledky!B23","v":"00:23:00"},{"$f":"výsledky!C23","v":"00:05:50"},{"$f":"výsledky!D23","v":8},{"$f":"IFERROR(VLOOKUP($D19,prezence!A:F,2,0),\"\")","v":"Deverová"},{"$f":"IFERROR(VLOOKUP($D19,prezence!A:F,3,0),\"\")","v":"Lenka"},{"$f":"IFERROR(VLOOKUP($D19,prezence!A:F,4,0),\"\")","v":1992}]
[19,{"$f":"výsledky!B24","v":"00:23:12"},{"$f":"výsledky!C24","v":"00:06:02"},{"$f":"výsledky!D24","v":31},{"$f":"IFERROR(VLOOKUP($D20,prezence!A:F,2,0),\"\")","v":"Klánová"},{"$f":"IFERROR(VLOOKUP($D20,prezence!A:F,3,0),\"\")","v":"Michaela"},{"$f":"IFERROR(VLOOKUP($D20,prezence!A:F,4,0),\"\")","v":1991}]
[20,{"$f":"výsledky!B25","v":"00:23:12"},{"$f":"výsledky!C25","v":"00:06:02"},{"$f":"výsledky!D25","v":35},{"$f":"IFERROR(VLOOKUP($D21,prezence!A:F,2,0),\"\")","v":"Světlý"},{"$f":"IFERROR(VLOOKUP($D21,prezence!A:F,3,0),\"\")","v":"Ondřej"},{"$f":"IFERROR(VLOOKUP($D21,prezence!A:F,4,0),\"\")","v":1979}]
[21,{"$f":"výsledky!B26","v":"00:23:49"},{"$f":"výsledky!C26","v":"00:06:39"},{"$f":"výsledky!D26","v":41},{"$f":"IFERROR(VLOOKUP($D22,prezence!A:F,2,0),\"\")","v":"Sedláčková"},{"$f":"IFERROR(VLOOKUP($D22,prezence!A:F,3,0),\"\")","v":"Petra"},{"$f":"IFERROR(VLOOKUP($D22,prezence!A:F,4,0),\"\")","v":1993}]
[22,{"$f":"výsledky!B27","v":"00:23:49"},{"$f":"výsledky!C27","v":"00:06:39"},{"$f":"výsledky!D27","v":43},{"$f":"IFERROR(VLOOKUP($D23,prezence!A:F,2,0),\"\")","v":"Honka"},{"$f":"IFERROR(VLOOKUP($D23,prezence!A:F,3,0),\"\")","v":"Adela"},{"$f":"IFERROR(VLOOKUP($D23,prezence!A:F,4,0),\"\")","v":1994}]
[23,{"$f":"výsledky!B28","v":"00:24:06"},{"$f":"výsledky!C28","v":"00:06:56"},{"$f":"výsledky!D28","v":30},{"$f":"IFERROR(VLOOKUP($D24,prezence!A:F,2,0),\"\")","v":"Charvátová"},{"$f":"IFERROR(VLOOKUP($D24,prezence!A:F,3,0),\"\")","v":"Michaela"},{"$f":"IFERROR(VLOOKUP($D24,prezence!A:F,4,0),\"\")","v":1991}]
[24,{"$f":"výsledky!B29","v":"00:24:10"},{"$f":"výsledky!C29","v":"00:07:00"},{"$f":"výsledky!D29","v":23},{"$f":"IFERROR(VLOOKUP($D25,prezence!A:F,2,0),\"\")","v":"Lukšík"},{"$f":"IFERROR(VLOOKUP($D25,prezence!A:F,3,0),\"\")","v":"Václav"},{"$f":"IFERROR(VLOOKUP($D25,prezence!A:F,4,0),\"\")","v":1977}]
[25,{"$f":"výsledky!B30","v":"00:24:16"},{"$f":"výsledky!C30","v":"00:07:06"},{"$f":"výsledky!D30","v":25},{"$f":"IFERROR(VLOOKUP($D26,prezence!A:F,2,0),\"\")","v":"Kusá"},{"$f":"IFERROR(VLOOKUP($D26,prezence!A:F,3,0),\"\")","v":"Lenka"},{"$f":"IFERROR(VLOOKUP($D26,prezence!A:F,4,0),\"\")","v":1973}]
[26,{"$f":"výsledky!B31","v":"00:24:31"},{"$f":"výsledky!C31","v":"00:07:21"},{"$f":"výsledky!D31","v":21},{"$f":"IFERROR(VLOOKUP($D27,prezence!A:F,2,0),\"\")","v":"Urbanová"},{"$f":"IFERROR(VLOOKUP($D27,prezence!A:F,3,0),\"\")","v":"Jaroslava"},{"$f":"IFERROR(VLOOKUP($D27,prezence!A:F,4,0),\"\")","v":1964}]
[27,{"$f":"výsledky!B32","v":"00:24:31"},{"$f":"výsledky!C32","v":"00:07:21"},{"$f":"výsledky!D32","v":22},{"$f":"IFERROR(VLOOKUP($D28,prezence!A:F,2,0),\"\")","v":"Vitovský"},{"$f":"IFERROR(VLOOKUP($D28,prezence!A:F,3,0),\"\")","v":"Petr"},{"$f":"IFERROR(VLOOKUP($D28,prezence!A:F,4,0),\"\")","v":1964}]
[28,{"$f":"výsledky!B33","v":"00:25:19"},{"$f":"výsledky!C33","v":"00:08:09"},{"$f":"výsledky!D33","v":38},{"$f":"IFERROR(VLOOKUP($D29,prezence!A:F,2,0),\"\")","v":"Jirmus"},{"$f":"IFERROR(VLOOKUP($D29,prezence!A:F,3,0),\"\")","v":"Michal"},{"$f":"IFERROR(VLOOKUP($D29,prezence!A:F,4,0),\"\")","v":1992}]
[29,{"$f":"výsledky!B34","v":"00:25:23"},{"$f":"výsledky!C34","v":"00:08:13"},{"$f":"výsledky!D34","v":28},{"$f":"IFERROR(VLOOKUP($D30,prezence!A:F,2,0),\"\")","v":"RŮŽIČKA"},{"$f":"IFERROR(VLOOKUP($D30,prezence!A:F,3,0),\"\")","v":"PAVEL"},{"$f":"IFERROR(VLOOKUP($D30,prezence!A:F,4,0),\"\")","v":1964}]
{"$rows_left_out":171}