{"text_format":"3","workbook":"xlsx","n_sheets":4,"sheets":["výsledky","prezence","počet kol","LCD"],"not_rendered":{"images":1,"macros":1},"read":"whole","date_system":"1900"}

{"sheet":"výsledky","index":0,"n_rows":205,"n_cols":10,"rows_kept":205}
["Louny - Olympijský běh, 21.6. 2023",{"$nulls":8},"Do sloupce B se proklikávají výsledné časy (Ctrl+Z/Y)"]
[{"$nulls":3},{"$f":"COUNTA(prezence!A:A)-1","v":41},"registrovaných",{"$nulls":4},"Do sloupce D zapiš startovní číslo"]
[{"$nulls":9},"Tlačítko Start = Ctrl+m (pozor vymaže všechny dosažené časy)"]
["Start",45098.74998842592]
["Poř.","Čas","Ztráta","St. č.","Příjmení","Jméno","Nar.","Klub","Kategorie"]
[1,"00:17:10","-",20,{"$f":"IFERROR(VLOOKUP($D6,prezence!A:F,2,0),\"\")","v":"Huja"},{"$f":"IFERROR(VLOOKUP($D6,prezence!A:F,3,0),\"\")","v":"Vitezslav"},{"$f":"IFERROR(VLOOKUP($D6,prezence!A:F,4,0),\"\")","v":1987},{"$f":"IFERROR(VLOOKUP($D6,prezence!A:F,5,0),\"\")","v":"Vitezslav"},{"$f":"IFERROR(VLOOKUP($D6,prezence!A:F,6,0),\"\")","v":0}]
[2,"00:17:32",{"$f":"B7-$B$6","v":"00:00:22"},10,{"$f":"IFERROR(VLOOKUP($D7,prezence!A:F,2,0),\"\")","v":"Reiner"},{"$f":"IFERROR(VLOOKUP($D7,prezence!A:F,3,0),\"\")","v":"Lukáš"},{"$f":"IFERROR(VLOOKUP($D7,prezence!A:F,4,0),\"\")","v":1980},{"$f":"IFERROR(VLOOKUP($D7,prezence!A:F,5,0),\"\")","v":"Lukáš"},{"$f":"IFERROR(VLOOKUP($D7,prezence!A:F,6,0),\"\")","v":0}]
[3,"00:17:41","00:00:31",14,{"$f":"IFERROR(VLOOKUP($D8,prezence!A:F,2,0),\"\")","v":"Karasová"},{"$f":"IFERROR(VLOOKUP($D8,prezence!A:F,3,0),\"\")","v":"Anna"},{"$f":"IFERROR(VLOOKUP($D8,prezence!A:F,4,0),\"\")","v":1984},{"$f":"IFERROR(VLOOKUP($D8,prezence!A:F,5,0),\"\")","v":"Anna"},{"$f":"IFERROR(VLOOKUP($D8,prezence!A:F,6,0),\"\")","v":0}]
[4,"00:18:56","00:01:46",27,{"$f":"IFERROR(VLOOKUP($D9,prezence!A:F,2,0),\"\")","v":"Gaube"},{"$f":"IFERROR(VLOOKUP($D9,prezence!A:F,3,0),\"\")","v":"Jitka"},{"$f":"IFERROR(VLOOKUP($D9,prezence!A:F,4,0),\"\")","v":1983},{"$f":"IFERROR(VLOOKUP($D9,prezence!A:F,5,0),\"\")","v":"Jíťa"},{"$f":"IFERROR(VLOOKUP($D9,prezence!A:F,6,0),\"\")","v":0}]
[5,"00:19:23","00:02:13",37,{"$f":"IFERROR(VLOOKUP($D10,prezence!A:F,2,0),\"\")","v":"Kosina"},{"$f":"IFERROR(VLOOKUP($D10,prezence!A:F,3,0),\"\")","v":"Jakub"},{"$f":"IFERROR(VLOOKUP($D10,prezence!A:F,4,0),\"\")","v":1990},{"$f":"IFERROR(VLOOKUP($D10,prezence!A:F,5,0),\"\")","v":"Jakub"},{"$f":"IFERROR(VLOOKUP($D10,prezence!A:F,6,0),\"\")","v":0}]
[6,"00:19:35","00:02:25",13,{"$f":"IFERROR(VLOOKUP($D11,prezence!A:F,2,0),\"\")","v":"Burianová"},{"$f":"IFERROR(VLOOKUP($D11,prezence!A:F,3,0),\"\")","v":"Denisa"},{"$f":"IFERROR(VLOOKUP($D11,prezence!A:F,4,0),\"\")","v":1993},{"$f":"IFERROR(VLOOKUP($D11,prezence!A:F,5,0),\"\")","v":"Denda"},{"$f":"IFERROR(VLOOKUP($D11,prezence!A:F,6,0),\"\")","v":0}]
[7,"00:20:07",{"$f":"B12-$B$6","v":"00:02:57"},34,{"$f":"IFERROR(VLOOKUP($D12,prezence!A:F,2,0),\"\")","v":"Odvárka"},{"$f":"IFERROR(VLOOKUP($D12,prezence!A:F,3,0),\"\")","v":"Lukáš"},{"$f":"IFERROR(VLOOKUP($D12,prezence!A:F,4,0),\"\")","v":1985},{"$f":"IFERROR(VLOOKUP($D12,prezence!A:F,5,0),\"\")","v":"Lukáš"},{"$f":"IFERROR(VLOOKUP($D12,prezence!A:F,6,0),\"\")","v":0}]
[8,"00:20:21","00:03:11",33,{"$f":"IFERROR(VLOOKUP($D13,prezence!A:F,2,0),\"\")","v":"Petrmichl"},{"$f":"IFERROR(VLOOKUP($D13,prezence!A:F,3,0),\"\")","v":"Vít"},{"$f":"IFERROR(VLOOKUP($D13,prezence!A:F,4,0),\"\")","v":1987},{"$f":"IFERROR(VLOOKUP($D13,prezence!A:F,5,0),\"\")","v":"Vít"},{"$f":"IFERROR(VLOOKUP($D13,prezence!A:F,6,0),\"\")","v":0}]
[9,"00:20:24","00:03:14",39,{"$f":"IFERROR(VLOOKUP($D14,prezence!A:F,2,0),\"\")","v":"Pásztor"},{"$f":"IFERROR(VLOOKUP($D14,prezence!A:F,3,0),\"\")","v":"Michal"},{"$f":"IFERROR(VLOOKUP($D14,prezence!A:F,4,0),\"\")","v":1981},{"$f":"IFERROR(VLOOKUP($D14,prezence!A:F,5,0),\"\")","v":"Michal"},{"$f":"IFERROR(VLOOKUP($D14,prezence!A:F,6,0),\"\")","v":0}]
[10,"00:20:26","00:03:16",15,{"$f":"IFERROR(VLOOKUP($D15,prezence!A:F,2,0),\"\")","v":"Karas"},{"$f":"IFERROR(VLOOKUP($D15,prezence!A:F,3,0),\"\")","v":"Václav"},{"$f":"IFERROR(VLOOKUP($D15,prezence!A:F,4,0),\"\")","v":1980},{"$f":"IFERROR(VLOOKUP($D15,prezence!A:F,5,0),\"\")","v":"Václav"},{"$f":"IFERROR(VLOOKUP($D15,prezence!A:F,6,0),\"\")","v":0}]
[11,"00:20:59","00:03:49",17,{"$f":"IFERROR(VLOOKUP($D16,prezence!A:F,2,0),\"\")","v":"Sainer"},{"$f":"IFERROR(VLOOKUP($D16,prezence!A:F,3,0),\"\")","v":"Jiri"},{"$f":"IFERROR(VLOOKUP($D16,prezence!A:F,4,0),\"\")","v":1983},{"$f":"IFERROR(VLOOKUP($D16,prezence!A:F,5,0),\"\")","v":"Sainy"},{"$f":"IFERROR(VLOOKUP($D16,prezence!A:F,6,0),\"\")","v":0}]
[12,"00:21:11","00:04:01",6,{"$f":"IFERROR(VLOOKUP($D17,prezence!A:F,2,0),\"\")","v":"Riedl"},{"$f":"IFERROR(VLOOKUP($D17,prezence!A:F,3,0),\"\")","v":"Lukas"},{"$f":"IFERROR(VLOOKUP($D17,prezence!A:F,4,0),\"\")","v":1983},{"$f":"IFERROR(VLOOKUP($D17,prezence!A:F,5,0),\"\")","v":"PEKY"},{"$f":"IFERROR(VLOOKUP($D17,prezence!A:F,6,0),\"\")","v":0}]
[13,"00:21:27","00:04:17",26,{"$f":"IFERROR(VLOOKUP($D18,prezence!A:F,2,0),\"\")","v":"Kusý"},{"$f":"IFERROR(VLOOKUP($D18,prezence!A:F,3,0),\"\")","v":"Jan"},{"$f":"IFERROR(VLOOKUP($D18,prezence!A:F,4,0),\"\")","v":1974},{"$f":"IFERROR(VLOOKUP($D18,prezence!A:F,5,0),\"\")","v":"kusič"},{"$f":"IFERROR(VLOOKUP($D18,prezence!A:F,6,0),\"\")","v":0}]
[14,"00:21:31","00:04:21",19,{"$f":"IFERROR(VLOOKUP($D19,prezence!A:F,2,0),\"\")","v":"Sejvalová"},{"$f":"IFERROR(VLOOKUP($D19,prezence!A:F,3,0),\"\")","v":"Veronika"},{"$f":"IFERROR(VLOOKUP($D19,prezence!A:F,4,0),\"\")","v":1986},{"$f":"IFERROR(VLOOKUP($D19,prezence!A:F,5,0),\"\")","v":"Veronika"},{"$f":"IFERROR(VLOOKUP($D19,prezence!A:F,6,0),\"\")","v":0}]
[15,"00:21:37","00:04:27",9,{"$f":"IFERROR(VLOOKUP($D20,prezence!A:F,2,0),\"\")","v":"Macháčková"},{"$f":"IFERROR(VLOOKUP($D20,prezence!A:F,3,0),\"\")","v":"Michaela"},{"$f":"IFERROR(VLOOKUP($D20,prezence!A:F,4,0),\"\")","v":1980},{"$f":"IFERROR(VLOOKUP($D20,prezence!A:F,5,0),\"\")","v":"Michaela"},{"$f":"IFERROR(VLOOKUP($D20,prezence!A:F,6,0),\"\")","v":0}]
[16,"00:21:54","00:04:44",1,{"$f":"IFERROR(VLOOKUP($D21,prezence!A:F,2,0),\"\")","v":"Müller"},{"$f":"IFERROR(VLOOKUP($D21,prezence!A:F,3,0),\"\")","v":"Josef"},{"$f":"IFERROR(VLOOKUP($D21,prezence!A:F,4,0),\"\")","v":1974},{"$f":"IFERROR(VLOOKUP($D21,prezence!A:F,5,0),\"\")","v":"PEPINO"},{"$f":"IFERROR(VLOOKUP($D21,prezence!A:F,6,0),\"\")","v":0}]
[17,"00:22:36","00:05:26",7,{"$f":"IFERROR(VLOOKUP($D22,prezence!A:F,2,0),\"\")","v":"Horská"},{"$f":"IFERROR(VLOOKUP($D22,prezence!A:F,3,0),\"\")","v":"Kateřina"},{"$f":"IFERROR(VLOOKUP($D22,prezence!A:F,4,0),\"\")","v":1991},{"$f":"IFERROR(VLOOKUP($D22,prezence!A:F,5,0),\"\")","v":"Khaty"},{"$f":"IFERROR(VLOOKUP($D22,prezence!A:F,6,0),\"\")","v":0}]
[18,"00:23:00","00:05:50",8,{"$f":"IFERROR(VLOOKUP($D23,prezence!A:F,2,0),\"\")","v":"Deverová"},{"$f":"IFERROR(VLOOKUP($D23,prezence!A:F,3,0),\"\")","v":"Lenka"},{"$f":"IFERROR(VLOOKUP($D23,prezence!A:F,4,0),\"\")","v":1992},{"$f":"IFERROR(VLOOKUP($D23,prezence!A:F,5,0),\"\")","v":"Deverka"},{"$f":"IFERROR(VLOOKUP($D23,prezence!A:F,6,0),\"\")","v":0}]
[19,"00:23:12","00:06:02",31,{"$f":"IFERROR(VLOOKUP($D24,prezence!A:F,2,0),\"\")","v":"Klánová"},{"$f":"IFERROR(VLOOKUP($D24,prezence!A:F,3,0),\"\")","v":"Michaela"},{"$f":"IFERROR(VLOOKUP($D24,prezence!A:F,4,0),\"\")","v":1991},{"$f":"IFERROR(VLOOKUP($D24,prezence!A:F,5,0),\"\")","v":"Michaela"},{"$f":"IFERROR(VLOOKUP($D24,prezence!A:F,6,0),\"\")","v":0}]
[20,"00:23:12","00:06:02",35,{"$f":"IFERROR(VLOOKUP($D25,prezence!A:F,2,0),\"\")","v":"Světlý"},{"$f":"IFERROR(VLOOKUP($D25,prezence!A:F,3,0),\"\")","v":"Ondřej"},{"$f":"IFERROR(VLOOKUP($D25,prezence!A:F,4,0),\"\")","v":1979},{"$f":"IFERROR(VLOOKUP($D25,prezence!A:F,5,0),\"\")","v":"Ondřej"},{"$f":"IFERROR(VLOOKUP($D25,prezence!A:F,6,0),\"\")","v":0}]
[21,"00:23:49","00:06:39",41,{"$f":"IFERROR(VLOOKUP($D26,prezence!A:F,2,0),\"\")","v":"Sedláčková"},{"$f":"IFERROR(VLOOKUP($D26,prezence!A:F,3,0),\"\")","v":"Petra"},{"$f":"IFERROR(VLOOKUP($D26,prezence!A:F,4,0),\"\")","v":1993},{"$f":"IFERROR(VLOOKUP($D26,prezence!A:F,5,0),\"\")","v":"Petra"},{"$f":"IFERROR(VLOOKUP($D26,prezence!A:F,6,0),\"\")","v":0}]
[22,"00:23:49","00:06:39",43,{"$f":"IFERROR(VLOOKUP($D27,prezence!A:F,2,0),\"\")","v":"Honka"},{"$f":"IFERROR(VLOOKUP($D27,prezence!A:F,3,0),\"\")","v":"Adela"},{"$f":"IFERROR(VLOOKUP($D27,prezence!A:F,4,0),\"\")","v":1994},{"$f":"IFERROR(VLOOKUP($D27,prezence!A:F,5,0),\"\")","v":"Adela"},{"$f":"IFERROR(VLOOKUP($D27,prezence!A:F,6,0),\"\")","v":0}]
[23,"00:24:06","00:06:56",30,{"$f":"IFERROR(VLOOKUP($D28,prezence!A:F,2,0),\"\")","v":"Charvátová"},{"$f":"IFERROR(VLOOKUP($D28,prezence!A:F,3,0),\"\")","v":"Michaela"},{"$f":"IFERROR(VLOOKUP($D28,prezence!A:F,4,0),\"\")","v":1991},{"$f":"IFERROR(VLOOKUP($D28,prezence!A:F,5,0),\"\")","v":"Michaela"},{"$f":"IFERROR(VLOOKUP($D28,prezence!A:F,6,0),\"\")","v":0}]
[24,"00:24:10","00:07:00",23,{"$f":"IFERROR(VLOOKUP($D29,prezence!A:F,2,0),\"\")","v":"Lukšík"},{"$f":"IFERROR(VLOOKUP($D29,prezence!A:F,3,0),\"\")","v":"Václav"},{"$f":"IFERROR(VLOOKUP($D29,prezence!A:F,4,0),\"\")","v":1977},{"$f":"IFERROR(VLOOKUP($D29,prezence!A:F,5,0),\"\")","v":"Čáryfuk"},{"$f":"IFERROR(VLOOKUP($D29,prezence!A:F,6,0),\"\")","v":0}]
[25,"00:24:16","00:07:06",25,{"$f":"IFERROR(VLOOKUP($D30,prezence!A:F,2,0),\"\")","v":"Kusá"},{"$f":"IFERROR(VLOOKUP($D30,prezence!A:F,3,0),\"\")","v":"Lenka"},{"$f":"IFERROR(VLOOKUP($D30,prezence!A:F,4,0),\"\")","v":1973},{"$f":"IFERROR(VLOOKUP($D30,prezence!A:F,5,0),\"\")","v":"kusička"},{"$f":"IFERROR(VLOOKUP($D30,prezence!A:F,6,0),\"\")","v":0}]
[26,"00:24:31","00:07:21",21,{"$f":"IFERROR(VLOOKUP($D31,prezence!A:F,2,0),\"\")","v":"Urbanová"},{"$f":"IFERROR(VLOOKUP($D31,prezence!A:F,3,0),\"\")","v":"Jaroslava"},{"$f":"IFERROR(VLOOKUP($D31,prezence!A:F,4,0),\"\")","v":1964},{"$f":"IFERROR(VLOOKUP($D31,prezence!A:F,5,0),\"\")","v":"Jaroslava"},{"$f":"IFERROR(VLOOKUP($D31,prezence!A:F,6,0),\"\")","v":0}]
[27,"00:24:31","00:07:21",22,{"$f":"IFERROR(VLOOKUP($D32,prezence!A:F,2,0),\"\")","v":"Vitovský"},{"$f":"IFERROR(VLOOKUP($D32,prezence!A:F,3,0),\"\")","v":"Petr"},{"$f":"IFERROR(VLOOKUP($D32,prezence!A:F,4,0),\"\")","v":1964},{"$f":"IFERROR(VLOOKUP($D32,prezence!A:F,5,0),\"\")","v":"Cukrar"},{"$f":"IFERROR(VLOOKUP($D32,prezence!A:F,6,0),\"\")","v":0}]
[28,"00:25:19","00:08:09",38,{"$f":"IFERROR(VLOOKUP($D33,prezence!A:F,2,0),\"\")","v":"Jirmus"},{"$f":"IFERROR(VLOOKUP($D33,prezence!A:F,3,0),\"\")","v":"Michal"},{"$f":"IFERROR(VLOOKUP($D33,prezence!A:F,4,0),\"\")","v":1992},{"$f":"IFERROR(VLOOKUP($D33,prezence!A:F,5,0),\"\")","v":"Michal"},{"$f":"IFERROR(VLOOKUP($D33,prezence!A:F,6,0),\"\")","v":0}]
[29,"00:25:23","00:08:13",28,{"$f":"IFERROR(VLOOKUP($D34,prezence!A:F,2,0),\"\")","v":"RŮŽIČKA"},{"$f":"IFERROR(VLOOKUP($D34,prezence!A:F,3,0),\"\")","v":"PAVEL"},{"$f":"IFERROR(VLOOKUP($D34,prezence!A:F,4,0),\"\")","v":1964},{"$f":"IFERROR(VLOOKUP($D34,prezence!A:F,5,0),\"\")","v":"PAVEL"},{"$f":"IFERROR(VLOOKUP($D34,prezence!A:F,6,0),\"\")","v":0}]
[30,"00:25:28","00:08:18",5,{"$f":"IFERROR(VLOOKUP($D35,prezence!A:F,2,0),\"\")","v":"Gavelčík"},{"$f":"IFERROR(VLOOKUP($D35,prezence!A:F,3,0),\"\")","v":"Tomáš"},{"$f":"IFERROR(VLOOKUP($D35,prezence!A:F,4,0),\"\")","v":1985},{"$f":"IFERROR(VLOOKUP($D35,prezence!A:F,5,0),\"\")","v":"Tomáš"},{"$f":"IFERROR(VLOOKUP($D35,prezence!A:F,6,0),\"\")","v":0}]
[31,"00:26:54","00:09:44",18,{"$f":"IFERROR(VLOOKUP($D36,prezence!A:F,2,0),\"\")","v":"Sejval"},{"$f":"IFERROR(VLOOKUP($D36,prezence!A:F,3,0),\"\")","v":"Jan"},{"$f":"IFERROR(VLOOKUP($D36,prezence!A:F,4,0),\"\")","v":1979},{"$f":"IFERROR(VLOOKUP($D36,prezence!A:F,5,0),\"\")","v":"Jan"},{"$f":"IFERROR(VLOOKUP($D36,prezence!A:F,6,0),\"\")","v":0}]
[32,"00:26:55","00:09:45",40,{"$f":"IFERROR(VLOOKUP($D37,prezence!A:F,2,0),\"\")","v":"Doležalová"},{"$f":"IFERROR(VLOOKUP($D37,prezence!A:F,3,0),\"\")","v":"Michaela"},{"$f":"IFERROR(VLOOKUP($D37,prezence!A:F,4,0),\"\")","v":1980},{"$f":"IFERROR(VLOOKUP($D37,prezence!A:F,5,0),\"\")","v":"Michaela"},{"$f":"IFERROR(VLOOKUP($D37,prezence!A:F,6,0),\"\")","v":0}]
[33,"00:28:15","00:11:05",2,{"$f":"IFERROR(VLOOKUP($D38,prezence!A:F,2,0),\"\")","v":"Peštová"},{"$f":"IFERROR(VLOOKUP($D38,prezence!A:F,3,0),\"\")","v":"Jana"},{"$f":"IFERROR(VLOOKUP($D38,prezence!A:F,4,0),\"\")","v":1980},{"$f":"IFERROR(VLOOKUP($D38,prezence!A:F,5,0),\"\")","v":"TÉRA"},{"$f":"IFERROR(VLOOKUP($D38,prezence!A:F,6,0),\"\")","v":0}]
[34,"00:28:30","00:11:20",12,{"$f":"IFERROR(VLOOKUP($D39,prezence!A:F,2,0),\"\")","v":"Rousova"},{"$f":"IFERROR(VLOOKUP($D39,prezence!A:F,3,0),\"\")","v":"Lucie"},{"$f":"IFERROR(VLOOKUP($D39,prezence!A:F,4,0),\"\")","v":2002},{"$f":"IFERROR(VLOOKUP($D39,prezence!A:F,5,0),\"\")","v":"Lucie"},{"$f":"IFERROR(VLOOKUP($D39,prezence!A:F,6,0),\"\")","v":0}]
[35,"00:28:30","00:11:20",11,{"$f":"IFERROR(VLOOKUP($D40,prezence!A:F,2,0),\"\")","v":"Rousova"},{"$f":"IFERROR(VLOOKUP($D40,prezence!A:F,3,0),\"\")","v":"Julie"},{"$f":"IFERROR(VLOOKUP($D40,prezence!A:F,4,0),\"\")","v":1999},{"$f":"IFERROR(VLOOKUP($D40,prezence!A:F,5,0),\"\")","v":"Julie"},{"$f":"IFERROR(VLOOKUP($D40,prezence!A:F,6,0),\"\")","v":0}]
[36,"00:29:59","00:12:49",36,{"$f":"IFERROR(VLOOKUP($D41,prezence!A:F,2,0),\"\")","v":"Pfeiferová"},{"$f":"IFERROR(VLOOKUP($D41,prezence!A:F,3,0),\"\")","v":"Veronika"},{"$f":"IFERROR(VLOOKUP($D41,prezence!A:F,4,0),\"\")","v":1992},{"$f":"IFERROR(VLOOKUP($D41,prezence!A:F,5,0),\"\")","v":"Veronika"},{"$f":"IFERROR(VLOOKUP($D41,prezence!A:F,6,0),\"\")","v":0}]
[37,"00:31:46","00:14:36",4,{"$f":"IFERROR(VLOOKUP($D42,prezence!A:F,2,0),\"\")","v":"Sejvalová"},{"$f":"IFERROR(VLOOKUP($D42,prezence!A:F,3,0),\"\")","v":"Petra"},{"$f":"IFERROR(VLOOKUP($D42,prezence!A:F,4,0),\"\")","v":1978},{"$f":"IFERROR(VLOOKUP($D42,prezence!A:F,5,0),\"\")","v":"Peťuška"},{"$f":"IFERROR(VLOOKUP($D42,prezence!A:F,6,0),\"\")","v":0}]
[38,"00:34:55","00:17:45",42,{"$f":"IFERROR(VLOOKUP($D43,prezence!A:F,2,0),\"\")","v":"Vajová"},{"$f":"IFERROR(VLOOKUP($D43,prezence!A:F,3,0),\"\")","v":"Klára"},{"$f":"IFERROR(VLOOKUP($D43,prezence!A:F,4,0),\"\")","v":2003},{"$f":"IFERROR(VLOOKUP($D43,prezence!A:F,5,0),\"\")","v":"Klára"},{"$f":"IFERROR(VLOOKUP($D43,prezence!A:F,6,0),\"\")","v":0}]
[39,null,-0.011921296296296298,null,{"$f":"IFERROR(VLOOKUP($D44,prezence!A:F,2,0),\"\")","v":""},{"$f":"IFERROR(VLOOKUP($D44,prezence!A:F,3,0),\"\")","v":""},{"$f":"IFERROR(VLOOKUP($D44,prezence!A:F,4,0),\"\")","v":""},{"$f":"IFERROR(VLOOKUP($D44,prezence!A:F,5,0),\"\")","v":""},{"$f":"IFERROR(VLOOKUP($D44,prezence!A:F,6,0),\"\")","v":""}]
[40,null,-0.011921296296296298,null,{"$f":"IFERROR(VLOOKUP($D45,prezence!A:F,2,0),\"\")","v":""},{"$f":"IFERROR(VLOOKUP($D45,prezence!A:F,3,0),\"\")","v":""},{"$f":"IFERROR(VLOOKUP($D45,prezence!A:F,4,0),\"\")","v":""},{"$f":"IFERROR(VLOOKUP($D45,prezence!A:F,5,0),\"\")","v":""},{"$f":"IFERROR(VLOOKUP($D45,prezence!A:F,6,0),\"\")","v":""}]
[41,null,-0.011921296296296298,null,{"$f":"IFERROR(VLOOKUP($D46,prezence!A:F,2,0),\"\")","v":""},{"$f":"IFERROR(VLOOKUP($D46,prezence!A:F,3,0),\"\")","v":""},{"$f":"IFERROR(VLOOKUP($D46,prezence!A:F,4,0),\"\")","v":""},{"$f":"IFERROR(VLOOKUP($D46,prezence!A:F,5,0),\"\")","v":""},{"$f":"IFERROR(VLOOKUP($D46,prezence!A:F,6,0),\"\")","v":""}]
[42,null,-0.011921296296296298,null,{"$f":"IFERROR(VLOOKUP($D47,prezence!A:F,2,0),\"\")","v":""},{"$f":"IFERROR(VLOOKUP($D47,prezence!A:F,3,0),\"\")","v":""},{"$f":"IFERROR(VLOOKUP($D47,prezence!A:F,4,0),\"\")","v":""},{"$f":"IFERROR(VLOOKUP($D47,prezence!A:F,5,0),\"\")","v":""},{"$f":"IFERROR(VLOOKUP($D47,prezence!A:F,6,0),\"\")","v":""}]
[43,null,-0.011921296296296298,null,{"$f":"IFERROR(VLOOKUP($D48,prezence!A:F,2,0),\"\")","v":""},{"$f":"IFERROR(VLOOKUP($D48,prezence!A:F,3,0),\"\")","v":""},{"$f":"IFERROR(VLOOKUP($D48,prezence!A:F,4,0),\"\")","v":""},{"$f":"IFERROR(VLOOKUP($D48,prezence!A:F,5,0),\"\")","v":""},{"$f":"IFERROR(VLOOKUP($D48,prezence!A:F,6,0),\"\")","v":""}]
[44,null,-0.011921296296296298,null,{"$f":"IFERROR(VLOOKUP($D49,prezence!A:F,2,0),\"\")","v":""},{"$f":"IFERROR(VLOOKUP($D49,prezence!A:F,3,0),\"\")","v":""},{"$f":"IFERROR(VLOOKUP($D49,prezence!A:F,4,0),\"\")","v":""},{"$f":"IFERROR(VLOOKUP($D49,prezence!A:F,5,0),\"\")","v":""},{"$f":"IFERROR(VLOOKUP($D49,prezence!A:F,6,0),\"\")","v":""}]
[45,null,-0.011921296296296298,null,{"$f":"IFERROR(VLOOKUP($D50,prezence!A:F,2,0),\"\")","v":""},{"$f":"IFERROR(VLOOKUP($D50,prezence!A:F,3,0),\"\")","v":""},{"$f":"IFERROR(VLOOKUP($D50,prezence!A:F,4,0),\"\")","v":""},{"$f":"IFERROR(VLOOKUP($D50,prezence!A:F,5,0),\"\")","v":""},{"$f":"IFERROR(VLOOKUP($D50,prezence!A:F,6,0),\"\")","v":""}]
[46,null,-0.011921296296296298,null,{"$f":"IFERROR(VLOOKUP($D51,prezence!A:F,2,0),\"\")","v":""},{"$f":"IFERROR(VLOOKUP($D51,prezence!A:F,3,0),\"\")","v":""},{"$f":"IFERROR(VLOOKUP($D51,prezence!A:F,4,0),\"\")","v":""},{"$f":"IFERROR(VLOOKUP($D51,prezence!A:F,5,0),\"\")","v":""},{"$f":"IFERROR(VLOOKUP($D51,prezence!A:F,6,0),\"\")","v":""}]
[47,null,-0.011921296296296298,null,{"$f":"IFERROR(VLOOKUP($D52,prezence!A:F,2,0),\"\")","v":""},{"$f":"IFERROR(VLOOKUP($D52,prezence!A:F,3,0),\"\")","v":""},{"$f":"IFERROR(VLOOKUP($D52,prezence!A:F,4,0),\"\")","v":""},{"$f":"IFERROR(VLOOKUP($D52,prezence!A:F,5,0),\"\")","v":""},{"$f":"IFERROR(VLOOKUP($D52,prezence!A:F,6,0),\"\")","v":""}]
[48,null,-0.011921296296296298,null,{"$f":"IFERROR(VLOOKUP($D53,prezence!A:F,2,0),\"\")","v":""},{"$f":"IFERROR(VLOOKUP($D53,prezence!A:F,3,0),\"\")","v":""},{"$f":"IFERROR(VLOOKUP($D53,prezence!A:F,4,0),\"\")","v":""},{"$f":"IFERROR(VLOOKUP($D53,prezence!A:F,5,0),\"\")","v":""},{"$f":"IFERROR(VLOOKUP($D53,prezence!A:F,6,0),\"\")","v":""}]
[49,null,-0.011921296296296298,null,{"$f":"IFERROR(VLOOKUP($D54,prezence!A:F,2,0),\"\")","v":""},{"$f":"IFERROR(VLOOKUP($D54,prezence!A:F,3,0),\"\")","v":""},{"$f":"IFERROR(VLOOKUP($D54,prezence!A:F,4,0),\"\")","v":""},{"$f":"IFERROR(VLOOKUP($D54,prezence!A:F,5,0),\"\")","v":""},{"$f":"IFERROR(VLOOKUP($D54,prezence!A:F,6,0),\"\")","v":""}]
[50,null,-0.011921296296296298,null,{"$f":"IFERROR(VLOOKUP($D55,prezence!A:F,2,0),\"\")","v":""},{"$f":"IFERROR(VLOOKUP($D55,prezence!A:F,3,0),\"\")","v":""},{"$f":"IFERROR(VLOOKUP($D55,prezence!A:F,4,0),\"\")","v":""},{"$f":"IFERROR(VLOOKUP($D55,prezence!A:F,5,0),\"\")","v":""},{"$f":"IFERROR(VLOOKUP($D55,prezence!A:F,6,0),\"\")","v":""}]
[51,null,-0.011921296296296298,null,{"$f":"IFERROR(VLOOKUP($D56,prezence!A:F,2,0),\"\")","v":""},{"$f":"IFERROR(VLOOKUP($D56,prezence!A:F,3,0),\"\")","v":""},{"$f":"IFERROR(VLOOKUP($D56,prezence!A:F,4,0),\"\")","v":""},{"$f":"IFERROR(VLOOKUP($D56,prezence!A:F,5,0),\"\")","v":""},{"$f":"IFERROR(VLOOKUP($D56,prezence!A:F,6,0),\"\")","v":""}]
[52,null,-0.011921296296296298,null,{"$f":"IFERROR(VLOOKUP($D57,prezence!A:F,2,0),\"\")","v":""},{"$f":"IFERROR(VLOOKUP($D57,prezence!A:F,3,0),\"\")","v":""},{"$f":"IFERROR(VLOOKUP($D57,prezence!A:F,4,0),\"\")","v":""},{"$f":"IFERROR(VLOOKUP($D57,prezence!A:F,5,0),\"\")","v":""},{"$f":"IFERROR(VLOOKUP($D57,prezence!A:F,6,0),\"\")","v":""}]
[53,null,-0.011921296296296298,null,{"$f":"IFERROR(VLOOKUP($D58,prezence!A:F,2,0),\"\")","v":""},{"$f":"IFERROR(VLOOKUP($D58,prezence!A:F,3,0),\"\")","v":""},{"$f":"IFERROR(VLOOKUP($D58,prezence!A:F,4,0),\"\")","v":""},{"$f":"IFERROR(VLOOKUP($D58,prezence!A:F,5,0),\"\")","v":""},{"$f":"IFERROR(VLOOKUP($D58,prezence!A:F,6,0),\"\")","v":""}]
[54,null,-0.011921296296296298,null,{"$f":"IFERROR(VLOOKUP($D59,prezence!A:F,2,0),\"\")","v":""},{"$f":"IFERROR(VLOOKUP($D59,prezence!A:F,3,0),\"\")","v":""},{"$f":"IFERROR(VLOOKUP($D59,prezence!A:F,4,0),\"\")","v":""},{"$f":"IFERROR(VLOOKUP($D59,prezence!A:F,5,0),\"\")","v":""},{"$f":"IFERROR(VLOOKUP($D59,prezence!A:F,6,0),\"\")","v":""}]
[55,null,-0.011921296296296298,null,{"$f":"IFERROR(VLOOKUP($D60,prezence!A:F,2,0),\"\")","v":""},{"$f":"IFERROR(VLOOKUP($D60,prezence!A:F,3,0),\"\")","v":""},{"$f":"IFERROR(VLOOKUP($D60,prezence!A:F,4,0),\"\")","v":""},{"$f":"IFERROR(VLOOKUP($D60,prezence!A:F,5,0),\"\")","v":""},{"$f":"IFERROR(VLOOKUP($D60,prezence!A:F,6,0),\"\")","v":""}]
[56,null,-0.011921296296296298,null,{"$f":"IFERROR(VLOOKUP($D61,prezence!A:F,2,0),\"\")","v":""},{"$f":"IFERROR(VLOOKUP($D61,prezence!A:F,3,0),\"\")","v":""},{"$f":"IFERROR(VLOOKUP($D61,prezence!A:F,4,0),\"\")","v":""},{"$f":"IFERROR(VLOOKUP($D61,prezence!A:F,5,0),\"\")","v":""},{"$f":"IFERROR(VLOOKUP($D61,prezence!A:F,6,0),\"\")","v":""}]
[57,null,-0.011921296296296298,null,{"$f":"IFERROR(VLOOKUP($D62,prezence!A:F,2,0),\"\")","v":""},{"$f":"IFERROR(VLOOKUP($D62,prezence!A:F,3,0),\"\")","v":""},{"$f":"IFERROR(VLOOKUP($D62,prezence!A:F,4,0),\"\")","v":""},{"$f":"IFERROR(VLOOKUP($D62,prezence!A:F,5,0),\"\")","v":""},{"$f":"IFERROR(VLOOKUP($D62,prezence!A:F,6,0),\"\")","v":""}]
[58,null,-0.011921296296296298,null,{"$f":"IFERROR(VLOOKUP($D63,prezence!A:F,2,0),\"\")","v":""},{"$f":"IFERROR(VLOOKUP($D63,prezence!A:F,3,0),\"\")","v":""},{"$f":"IFERROR(VLOOKUP($D63,prezence!A:F,4,0),\"\")","v":""},{"$f":"IFERROR(VLOOKUP($D63,prezence!A:F,5,0),\"\")","v":""},{"$f":"IFERROR(VLOOKUP($D63,prezence!A:F,6,0),\"\")","v":""}]
[59,null,-0.011921296296296298,null,{"$f":"IFERROR(VLOOKUP($D64,prezence!A:F,2,0),\"\")","v":""},{"$f":"IFERROR(VLOOKUP($D64,prezence!A:F,3,0),\"\")","v":""},{"$f":"IFERROR(VLOOKUP($D64,prezence!A:F,4,0),\"\")","v":""},{"$f":"IFERROR(VLOOKUP($D64,prezence!A:F,5,0),\"\")","v":""},{"$f":"IFERROR(VLOOKUP($D64,prezence!A:F,6,0),\"\")","v":""}]
[60,null,-0.011921296296296298,null,{"$f":"IFERROR(VLOOKUP($D65,prezence!A:F,2,0),\"\")","v":""},{"$f":"IFERROR(VLOOKUP($D65,prezence!A:F,3,0),\"\")","v":""},{"$f":"IFERROR(VLOOKUP($D65,prezence!A:F,4,0),\"\")","v":""},{"$f":"IFERROR(VLOOKUP($D65,prezence!A:F,5,0),\"\")","v":""},{"$f":"IFERROR(VLOOKUP($D65,prezence!A:F,6,0),\"\")","v":""}]
[61,null,-0.011921296296296298,null,{"$f":"IFERROR(VLOOKUP($D66,prezence!A:F,2,0),\"\")","v":""},{"$f":"IFERROR(VLOOKUP($D66,prezence!A:F,3,0),\"\")","v":""},{"$f":"IFERROR(VLOOKUP($D66,prezence!A:F,4,0),\"\")","v":""},{"$f":"IFERROR(VLOOKUP($D66,prezence!A:F,5,0),\"\")","v":""},{"$f":"IFERROR(VLOOKUP($D66,prezence!A:F,6,0),\"\")","v":""}]
[62,null,-0.011921296296296298,null,{"$f":"IFERROR(VLOOKUP($D67,prezence!A:F,2,0),\"\")","v":""},{"$f":"IFERROR(VLOOKUP($D67,prezence!A:F,3,0),\"\")","v":""},{"$f":"IFERROR(VLOOKUP($D67,prezence!A:F,4,0),\"\")","v":""},{"$f":"IFERROR(VLOOKUP($D67,prezence!A:F,5,0),\"\")","v":""},{"$f":"IFERROR(VLOOKUP($D67,prezence!A:F,6,0),\"\")","v":""}]
[63,null,-0.011921296296296298,null,{"$f":"IFERROR(VLOOKUP($D68,prezence!A:F,2,0),\"\")","v":""},{"$f":"IFERROR(VLOOKUP($D68,prezence!A:F,3,0),\"\")","v":""},{"$f":"IFERROR(VLOOKUP($D68,prezence!A:F,4,0),\"\")","v":""},{"$f":"IFERROR(VLOOKUP($D68,prezence!A:F,5,0),\"\")","v":""},{"$f":"IFERROR(VLOOKUP($D68,prezence!A:F,6,0),\"\")","v":""}]
[64,null,-0.011921296296296298,null,{"$f":"IFERROR(VLOOKUP($D69,prezence!A:F,2,0),\"\")","v":""},{"$f":"IFERROR(VLOOKUP($D69,prezence!A:F,3,0),\"\")","v":""},{"$f":"IFERROR(VLOOKUP($D69,prezence!A:F,4,0),\"\")","v":""},{"$f":"IFERROR(VLOOKUP($D69,prezence!A:F,5,0),\"\")","v":""},{"$f":"IFERROR(VLOOKUP($D69,prezence!A:F,6,0),\"\")","v":""}]
[65,null,{"$f":"B70-$B$6","v":-0.011921296296296298},null,{"$f":"IFERROR(VLOOKUP($D70,prezence!A:F,2,0),\"\")","v":""},{"$f":"IFERROR(VLOOKUP($D70,prezence!A:F,3,0),\"\")","v":""},{"$f":"IFERROR(VLOOKUP($D70,prezence!A:F,4,0),\"\")","v":""},{"$f":"IFERROR(VLOOKUP($D70,prezence!A:F,5,0),\"\")","v":""},{"$f":"IFERROR(VLOOKUP($D70,prezence!A:F,6,0),\"\")","v":""}]
[66,null,-0.011921296296296298,null,{"$f":"IFERROR(VLOOKUP($D71,prezence!A:F,2,0),\"\")","v":""},{"$f":"IFERROR(VLOOKUP($D71,prezence!A:F,3,0),\"\")","v":""},{"$f":"IFERROR(VLOOKUP($D71,prezence!A:F,4,0),\"\")","v":""},{"$f":"IFERROR(VLOOKUP($D71,prezence!A:F,5,0),\"\")","v":""},{"$f":"IFERROR(VLOOKUP($D71,prezence!A:F,6,0),\"\")","v":""}]
[67,null,-0.011921296296296298,null,{"$f":"IFERROR(VLOOKUP($D72,prezence!A:F,2,0),\"\")","v":""},{"$f":"IFERROR(VLOOKUP($D72,prezence!A:F,3,0),\"\")","v":""},{"$f":"IFERROR(VLOOKUP($D72,prezence!A:F,4,0),\"\")","v":""},{"$f":"IFERROR(VLOOKUP($D72,prezence!A:F,5,0),\"\")","v":""},{"$f":"IFERROR(VLOOKUP($D72,prezence!A:F,6,0),\"\")","v":""}]
[68,null,-0.011921296296296298,null,{"$f":"IFERROR(VLOOKUP($D73,prezence!A:F,2,0),\"\")","v":""},{"$f":"IFERROR(VLOOKUP($D73,prezence!A:F,3,0),\"\")","v":""},{"$f":"IFERROR(VLOOKUP($D73,prezence!A:F,4,0),\"\")","v":""},{"$f":"IFERROR(VLOOKUP($D73,prezence!A:F,5,0),\"\")","v":""},{"$f":"IFERROR(VLOOKUP($D73,prezence!A:F,6,0),\"\")","v":""}]
[69,null,-0.011921296296296298,null,{"$f":"IFERROR(VLOOKUP($D74,prezence!A:F,2,0),\"\")","v":""},{"$f":"IFERROR(VLOOKUP($D74,prezence!A:F,3,0),\"\")","v":""},{"$f":"IFERROR(VLOOKUP($D74,prezence!A:F,4,0),\"\")","v":""},{"$f":"IFERROR(VLOOKUP($D74,prezence!A:F,5,0),\"\")","v":""},{"$f":"IFERROR(VLOOKUP($D74,prezence!A:F,6,0),\"\")","v":""}]
[70,null,-0.011921296296296298,null,{"$f":"IFERROR(VLOOKUP($D75,prezence!A:F,2,0),\"\")","v":""},{"$f":"IFERROR(VLOOKUP($D75,prezence!A:F,3,0),\"\")","v":""},{"$f":"IFERROR(VLOOKUP($D75,prezence!A:F,4,0),\"\")","v":""},{"$f":"IFERROR(VLOOKUP($D75,prezence!A:F,5,0),\"\")","v":""},{"$f":"IFERROR(VLOOKUP($D75,prezence!A:F,6,0),\"\")","v":""}]
[71,null,-0.011921296296296298,null,{"$f":"IFERROR(VLOOKUP($D76,prezence!A:F,2,0),\"\")","v":""},{"$f":"IFERROR(VLOOKUP($D76,prezence!A:F,3,0),\"\")","v":""},{"$f":"IFERROR(VLOOKUP($D76,prezence!A:F,4,0),\"\")","v":""},{"$f":"IFERROR(VLOOKUP($D76,prezence!A:F,5,0),\"\")","v":""},{"$f":"IFERROR(VLOOKUP($D76,prezence!A:F,6,0),\"\")","v":""}]
[72,null,-0.011921296296296298,null,{"$f":"IFERROR(VLOOKUP($D77,prezence!A:F,2,0),\"\")","v":""},{"$f":"IFERROR(VLOOKUP($D77,prezence!A:F,3,0),\"\")","v":""},{"$f":"IFERROR(VLOOKUP($D77,prezence!A:F,4,0),\"\")","v":""},{"$f":"IFERROR(VLOOKUP($D77,prezence!A:F,5,0),\"\")","v":""},{"$f":"IFERROR(VLOOKUP($D77,prezence!A:F,6,0),\"\")","v":""}]
[73,null,-0.011921296296296298,null,{"$f":"IFERROR(VLOOKUP($D78,prezence!A:F,2,0),\"\")","v":""},{"$f":"IFERROR(VLOOKUP($D78,prezence!A:F,3,0),\"\")","v":""},{"$f":"IFERROR(VLOOKUP($D78,prezence!A:F,4,0),\"\")","v":""},{"$f":"IFERROR(VLOOKUP($D78,prezence!A:F,5,0),\"\")","v":""},{"$f":"IFERROR(VLOOKUP($D78,prezence!A:F,6,0),\"\")","v":""}]
[74,null,-0.011921296296296298,null,{"$f":"IFERROR(VLOOKUP($D79,prezence!A:F,2,0),\"\")","v":""},{"$f":"IFERROR(VLOOKUP($D79,prezence!A:F,3,0),\"\")","v":""},{"$f":"IFERROR(VLOOKUP($D79,prezence!A:F,4,0),\"\")","v":""},{"$f":"IFERROR(VLOOKUP($D79,prezence!A:F,5,0),\"\")","v":""},{"$f":"IFERROR(VLOOKUP($D79,prezence!A:F,6,0),\"\")","v":""}]
[75,null,-0.011921296296296298,null,{"$f":"IFERROR(VLOOKUP($D80,prezence!A:F,2,0),\"\")","v":""},{"$f":"IFERROR(VLOOKUP($D80,prezence!A:F,3,0),\"\")","v":""},{"$f":"IFERROR(VLOOKUP($D80,prezence!A:F,4,0),\"\")","v":""},{"$f":"IFERROR(VLOOKUP($D80,prezence!A:F,5,0),\"\")","v":""},{"$f":"IFERROR(VLOOKUP($D80,prezence!A:F,6,0),\"\")","v":""}]
[76,null,-0.011921296296296298,null,{"$f":"IFERROR(VLOOKUP($D81,prezence!A:F,2,0),\"\")","v":""},{"$f":"IFERROR(VLOOKUP($D81,prezence!A:F,3,0),\"\")","v":""},{"$f":"IFERROR(VLOOKUP($D81,prezence!A:F,4,0),\"\")","v":""},{"$f":"IFERROR(VLOOKUP($D81,prezence!A:F,5,0),\"\")","v":""},{"$f":"IFERROR(VLOOKUP($D81,prezence!A:F,6,0),\"\")","v":""}]
[77,null,-0.011921296296296298,null,{"$f":"IFERROR(VLOOKUP($D82,prezence!A:F,2,0),\"\")","v":""},{"$f":"IFERROR(VLOOKUP($D82,prezence!A:F,3,0),\"\")","v":""},{"$f":"IFERROR(VLOOKUP($D82,prezence!A:F,4,0),\"\")","v":""},{"$f":"IFERROR(VLOOKUP($D82,prezence!A:F,5,0),\"\")","v":""},{"$f":"IFERROR(VLOOKUP($D82,prezence!A:F,6,0),\"\")","v":""}]
[78,null,-0.011921296296296298,null,{"$f":"IFERROR(VLOOKUP($D83,prezence!A:F,2,0),\"\")","v":""},{"$f":"IFERROR(VLOOKUP($D83,prezence!A:F,3,0),\"\")","v":""},{"$f":"IFERROR(VLOOKUP($D83,prezence!A:F,4,0),\"\")","v":""},{"$f":"IFERROR(VLOOKUP($D83,prezence!A:F,5,0),\"\")","v":""},{"$f":"IFERROR(VLOOKUP($D83,prezence!A:F,6,0),\"\")","v":""}]
[79,null,-0.011921296296296298,null,{"$f":"IFERROR(VLOOKUP($D84,prezence!A:F,2,0),\"\")","v":""},{"$f":"IFERROR(VLOOKUP($D84,prezence!A:F,3,0),\"\")","v":""},{"$f":"IFERROR(VLOOKUP($D84,prezence!A:F,4,0),\"\")","v":""},{"$f":"IFERROR(VLOOKUP($D84,prezence!A:F,5,0),\"\")","v":""},{"$f":"IFERROR(VLOOKUP($D84,prezence!A:F,6,0),\"\")","v":""}]
[80,null,-0.011921296296296298,null,{"$f":"IFERROR(VLOOKUP($D85,prezence!A:F,2,0),\"\")","v":""},{"$f":"IFERROR(VLOOKUP($D85,prezence!A:F,3,0),\"\")","v":""},{"$f":"IFERROR(VLOOKUP($D85,prezence!A:F,4,0),\"\")","v":""},{"$f":"IFERROR(VLOOKUP($D85,prezence!A:F,5,0),\"\")","v":""},{"$f":"IFERROR(VLOOKUP($D85,prezence!A:F,6,0),\"\")","v":""}]
[81,null,-0.011921296296296298,null,{"$f":"IFERROR(VLOOKUP($D86,prezence!A:F,2,0),\"\")","v":""},{"$f":"IFERROR(VLOOKUP($D86,prezence!A:F,3,0),\"\")","v":""},{"$f":"IFERROR(VLOOKUP($D86,prezence!A:F,4,0),\"\")","v":""},{"$f":"IFERROR(VLOOKUP($D86,prezence!A:F,5,0),\"\")","v":""},{"$f":"IFERROR(VLOOKUP($D86,prezence!A:F,6,0),\"\")","v":""}]
[82,null,-0.011921296296296298,null,{"$f":"IFERROR(VLOOKUP($D87,prezence!A:F,2,0),\"\")","v":""},{"$f":"IFERROR(VLOOKUP($D87,prezence!A:F,3,0),\"\")","v":""},{"$f":"IFERROR(VLOOKUP($D87,prezence!A:F,4,0),\"\")","v":""},{"$f":"IFERROR(VLOOKUP($D87,prezence!A:F,5,0),\"\")","v":""},{"$f":"IFERROR(VLOOKUP($D87,prezence!A:F,6,0),\"\")","v":""}]
[83,null,-0.011921296296296298,null,{"$f":"IFERROR(VLOOKUP($D88,prezence!A:F,2,0),\"\")","v":""},{"$f":"IFERROR(VLOOKUP($D88,prezence!A:F,3,0),\"\")","v":""},{"$f":"IFERROR(VLOOKUP($D88,prezence!A:F,4,0),\"\")","v":""},{"$f":"IFERROR(VLOOKUP($D88,prezence!A:F,5,0),\"\")","v":""},{"$f":"IFERROR(VLOOKUP($D88,prezence!A:F,6,0),\"\")","v":""}]
[84,null,-0.011921296296296298,null,{"$f":"IFERROR(VLOOKUP($D89,prezence!A:F,2,0),\"\")","v":""},{"$f":"IFERROR(VLOOKUP($D89,prezence!A:F,3,0),\"\")","v":""},{"$f":"IFERROR(VLOOKUP($D89,prezence!A:F,4,0),\"\")","v":""},{"$f":"IFERROR(VLOOKUP($D89,prezence!A:F,5,0),\"\")","v":""},{"$f":"IFERROR(VLOOKUP($D89,prezence!A:F,6,0),\"\")","v":""}]
[85,null,-0.011921296296296298,null,{"$f":"IFERROR(VLOOKUP($D90,prezence!A:F,2,0),\"\")","v":""},{"$f":"IFERROR(VLOOKUP($D90,prezence!A:F,3,0),\"\")","v":""},{"$f":"IFERROR(VLOOKUP($D90,prezence!A:F,4,0),\"\")","v":""},{"$f":"IFERROR(VLOOKUP($D90,prezence!A:F,5,0),\"\")","v":""},{"$f":"IFERROR(VLOOKUP($D90,prezence!A:F,6,0),\"\")","v":""}]
[86,null,-0.011921296296296298,null,{"$f":"IFERROR(VLOOKUP($D91,prezence!A:F,2,0),\"\")","v":""},{"$f":"IFERROR(VLOOKUP($D91,prezence!A:F,3,0),\"\")","v":""},{"$f":"IFERROR(VLOOKUP($D91,prezence!A:F,4,0),\"\")","v":""},{"$f":"IFERROR(VLOOKUP($D91,prezence!A:F,5,0),\"\")","v":""},{"$f":"IFERROR(VLOOKUP($D91,prezence!A:F,6,0),\"\")","v":""}]
[87,null,-0.011921296296296298,null,{"$f":"IFERROR(VLOOKUP($D92,prezence!A:F,2,0),\"\")","v":""},{"$f":"IFERROR(VLOOKUP($D92,prezence!A:F,3,0),\"\")","v":""},{"$f":"IFERROR(VLOOKUP($D92,prezence!A:F,4,0),\"\")","v":""},{"$f":"IFERROR(VLOOKUP($D92,prezence!A:F,5,0),\"\")","v":""},{"$f":"IFERROR(VLOOKUP($D92,prezence!A:F,6,0),\"\")","v":""}]
[88,null,-0.011921296296296298,null,{"$f":"IFERROR(VLOOKUP($D93,prezence!A:F,2,0),\"\")","v":""},{"$f":"IFERROR(VLOOKUP($D93,prezence!A:F,3,0),\"\")","v":""},{"$f":"IFERROR(VLOOKUP($D93,prezence!A:F,4,0),\"\")","v":""},{"$f":"IFERROR(VLOOKUP($D93,prezence!A:F,5,0),\"\")","v":""},{"$f":"IFERROR(VLOOKUP($D93,prezence!A:F,6,0),\"\")","v":""}]
[89,null,-0.011921296296296298,null,{"$f":"IFERROR(VLOOKUP($D94,prezence!A:F,2,0),\"\")","v":""},{"$f":"IFERROR(VLOOKUP($D94,prezence!A:F,3,0),\"\")","v":""},{"$f":"IFERROR(VLOOKUP($D94,prezence!A:F,4,0),\"\")","v":""},{"$f":"IFERROR(VLOOKUP($D94,prezence!A:F,5,0),\"\")","v":""},{"$f":"IFERROR(VLOOKUP($D94,prezence!A:F,6,0),\"\")","v":""}]
[90,null,-0.011921296296296298,null,{"$f":"IFERROR(VLOOKUP($D95,prezence!A:F,2,0),\"\")","v":""},{"$f":"IFERROR(VLOOKUP($D95,prezence!A:F,3,0),\"\")","v":""},{"$f":"IFERROR(VLOOKUP($D95,prezence!A:F,4,0),\"\")","v":""},{"$f":"IFERROR(VLOOKUP($D95,prezence!A:F,5,0),\"\")","v":""},{"$f":"IFERROR(VLOOKUP($D95,prezence!A:F,6,0),\"\")","v":""}]
[91,null,-0.011921296296296298,null,{"$f":"IFERROR(VLOOKUP($D96,prezence!A:F,2,0),\"\")","v":""},{"$f":"IFERROR(VLOOKUP($D96,prezence!A:F,3,0),\"\")","v":""},{"$f":"IFERROR(VLOOKUP($D96,prezence!A:F,4,0),\"\")","v":""},{"$f":"IFERROR(VLOOKUP($D96,prezence!A:F,5,0),\"\")","v":""},{"$f":"IFERROR(VLOOKUP($D96,prezence!A:F,6,0),\"\")","v":""}]
[92,null,-0.011921296296296298,null,{"$f":"IFERROR(VLOOKUP($D97,prezence!A:F,2,0),\"\")","v":""},{"$f":"IFERROR(VLOOKUP($D97,prezence!A:F,3,0),\"\")","v":""},{"$f":"IFERROR(VLOOKUP($D97,prezence!A:F,4,0),\"\")","v":""},{"$f":"IFERROR(VLOOKUP($D97,prezence!A:F,5,0),\"\")","v":""},{"$f":"IFERROR(VLOOKUP($D97,prezence!A:F,6,0),\"\")","v":""}]
[93,null,-0.011921296296296298,null,{"$f":"IFERROR(VLOOKUP($D98,prezence!A:F,2,0),\"\")","v":""},{"$f":"IFERROR(VLOOKUP($D98,prezence!A:F,3,0),\"\")","v":""},{"$f":"IFERROR(VLOOKUP($D98,prezence!A:F,4,0),\"\")","v":""},{"$f":"IFERROR(VLOOKUP($D98,prezence!A:F,5,0),\"\")","v":""},{"$f":"IFERROR(VLOOKUP($D98,prezence!A:F,6,0),\"\")","v":""}]
[94,null,-0.011921296296296298,null,{"$f":"IFERROR(VLOOKUP($D99,prezence!A:F,2,0),\"\")","v":""},{"$f":"IFERROR(VLOOKUP($D99,prezence!A:F,3,0),\"\")","v":""},{"$f":"IFERROR(VLOOKUP($D99,prezence!A:F,4,0),\"\")","v":""},{"$f":"IFERROR(VLOOKUP($D99,prezence!A:F,5,0),\"\")","v":""},{"$f":"IFERROR(VLOOKUP($D99,prezence!A:F,6,0),\"\")","v":""}]
[95,null,-0.011921296296296298,null,{"$f":"IFERROR(VLOOKUP($D100,prezence!A:F,2,0),\"\")","v":""},{"$f":"IFERROR(VLOOKUP($D100,prezence!A:F,3,0),\"\")","v":""},{"$f":"IFERROR(VLOOKUP($D100,prezence!A:F,4,0),\"\")","v":""},{"$f":"IFERROR(VLOOKUP($D100,prezence!A:F,5,0),\"\")","v":""},{"$f":"IFERROR(VLOOKUP($D100,prezence!A:F,6,0),\"\")","v":""}]
[96,null,-0.011921296296296298,null,{"$f":"IFERROR(VLOOKUP($D101,prezence!A:F,2,0),\"\")","v":""},{"$f":"IFERROR(VLOOKUP($D101,prezence!A:F,3,0),\"\")","v":""},{"$f":"IFERROR(VLOOKUP($D101,prezence!A:F,4,0),\"\")","v":""},{"$f":"IFERROR(VLOOKUP($D101,prezence!A:F,5,0),\"\")","v":""},{"$f":"IFERROR(VLOOKUP($D101,prezence!A:F,6,0),\"\")","v":""}]
[97,null,-0.011921296296296298,null,{"$f":"IFERROR(VLOOKUP($D102,prezence!A:F,2,0),\"\")","v":""},{"$f":"IFERROR(VLOOKUP($D102,prezence!A:F,3,0),\"\")","v":""},{"$f":"IFERROR(VLOOKUP($D102,prezence!A:F,4,0),\"\")","v":""},{"$f":"IFERROR(VLOOKUP($D102,prezence!A:F,5,0),\"\")","v":""},{"$f":"IFERROR(VLOOKUP($D102,prezence!A:F,6,0),\"\")","v":""}]
[98,null,-0.011921296296296298,null,{"$f":"IFERROR(VLOOKUP($D103,prezence!A:F,2,0),\"\")","v":""},{"$f":"IFERROR(VLOOKUP($D103,prezence!A:F,3,0),\"\")","v":""},{"$f":"IFERROR(VLOOKUP($D103,prezence!A:F,4,0),\"\")","v":""},{"$f":"IFERROR(VLOOKUP($D103,prezence!A:F,5,0),\"\")","v":""},{"$f":"IFERROR(VLOOKUP($D103,prezence!A:F,6,0),\"\")","v":""}]
[99,null,-0.011921296296296298,null,{"$f":"IFERROR(VLOOKUP($D104,prezence!A:F,2,0),\"\")","v":""},{"$f":"IFERROR(VLOOKUP($D104,prezence!A:F,3,0),\"\")","v":""},{"$f":"IFERROR(VLOOKUP($D104,prezence!A:F,4,0),\"\")","v":""},{"$f":"IFERROR(VLOOKUP($D104,prezence!A:F,5,0),\"\")","v":""},{"$f":"IFERROR(VLOOKUP($D104,prezence!A:F,6,0),\"\")","v":""}]
[100,null,-0.011921296296296298,null,{"$f":"IFERROR(VLOOKUP($D105,prezence!A:F,2,0),\"\")","v":""},{"$f":"IFERROR(VLOOKUP($D105,prezence!A:F,3,0),\"\")","v":""},{"$f":"IFERROR(VLOOKUP($D105,prezence!A:F,4,0),\"\")","v":""},{"$f":"IFERROR(VLOOKUP($D105,prezence!A:F,5,0),\"\")","v":""},{"$f":"IFERROR(VLOOKUP($D105,prezence!A:F,6,0),\"\")","v":""}]
[101,null,-0.011921296296296298,null,{"$f":"IFERROR(VLOOKUP($D106,prezence!A:F,2,0),\"\")","v":""},{"$f":"IFERROR(VLOOKUP($D106,prezence!A:F,3,0),\"\")","v":""},{"$f":"IFERROR(VLOOKUP($D106,prezence!A:F,4,0),\"\")","v":""},{"$f":"IFERROR(VLOOKUP($D106,prezence!A:F,5,0),\"\")","v":""},{"$f":"IFERROR(VLOOKUP($D106,prezence!A:F,6,0),\"\")","v":""}]
[102,null,-0.011921296296296298,null,{"$f":"IFERROR(VLOOKUP($D107,prezence!A:F,2,0),\"\")","v":""},{"$f":"IFERROR(VLOOKUP($D107,prezence!A:F,3,0),\"\")","v":""},{"$f":"IFERROR(VLOOKUP($D107,prezence!A:F,4,0),\"\")","v":""},{"$f":"IFERROR(VLOOKUP($D107,prezence!A:F,5,0),\"\")","v":""},{"$f":"IFERROR(VLOOKUP($D107,prezence!A:F,6,0),\"\")","v":""}]
[103,null,-0.011921296296296298,null,{"$f":"IFERROR(VLOOKUP($D108,prezence!A:F,2,0),\"\")","v":""},{"$f":"IFERROR(VLOOKUP($D108,prezence!A:F,3,0),\"\")","v":""},{"$f":"IFERROR(VLOOKUP($D108,prezence!A:F,4,0),\"\")","v":""},{"$f":"IFERROR(VLOOKUP($D108,prezence!A:F,5,0),\"\")","v":""},{"$f":"IFERROR(VLOOKUP($D108,prezence!A:F,6,0),\"\")","v":""}]
[104,null,-0.011921296296296298,null,{"$f":"IFERROR(VLOOKUP($D109,prezence!A:F,2,0),\"\")","v":""},{"$f":"IFERROR(VLOOKUP($D109,prezence!A:F,3,0),\"\")","v":""},{"$f":"IFERROR(VLOOKUP($D109,prezence!A:F,4,0),\"\")","v":""},{"$f":"IFERROR(VLOOKUP($D109,prezence!A:F,5,0),\"\")","v":""},{"$f":"IFERROR(VLOOKUP($D109,prezence!A:F,6,0),\"\")","v":""}]
[105,null,-0.011921296296296298,null,{"$f":"IFERROR(VLOOKUP($D110,prezence!A:F,2,0),\"\")","v":""},{"$f":"IFERROR(VLOOKUP($D110,prezence!A:F,3,0),\"\")","v":""},{"$f":"IFERROR(VLOOKUP($D110,prezence!A:F,4,0),\"\")","v":""},{"$f":"IFERROR(VLOOKUP($D110,prezence!A:F,5,0),\"\")","v":""},{"$f":"IFERROR(VLOOKUP($D110,prezence!A:F,6,0),\"\")","v":""}]
[106,null,-0.011921296296296298,null,{"$f":"IFERROR(VLOOKUP($D111,prezence!A:F,2,0),\"\")","v":""},{"$f":"IFERROR(VLOOKUP($D111,prezence!A:F,3,0),\"\")","v":""},{"$f":"IFERROR(VLOOKUP($D111,prezence!A:F,4,0),\"\")","v":""},{"$f":"IFERROR(VLOOKUP($D111,prezence!A:F,5,0),\"\")","v":""},{"$f":"IFERROR(VLOOKUP($D111,prezence!A:F,6,0),\"\")","v":""}]
[107,null,-0.011921296296296298,null,{"$f":"IFERROR(VLOOKUP($D112,prezence!A:F,2,0),\"\")","v":""},{"$f":"IFERROR(VLOOKUP($D112,prezence!A:F,3,0),\"\")","v":""},{"$f":"IFERROR(VLOOKUP($D112,prezence!A:F,4,0),\"\")","v":""},{"$f":"IFERROR(VLOOKUP($D112,prezence!A:F,5,0),\"\")","v":""},{"$f":"IFERROR(VLOOKUP($D112,prezence!A:F,6,0),\"\")","v":""}]
[108,null,-0.011921296296296298,null,{"$f":"IFERROR(VLOOKUP($D113,prezence!A:F,2,0),\"\")","v":""},{"$f":"IFERROR(VLOOKUP($D113,prezence!A:F,3,0),\"\")","v":""},{"$f":"IFERROR(VLOOKUP($D113,prezence!A:F,4,0),\"\")","v":""},{"$f":"IFERROR(VLOOKUP($D113,prezence!A:F,5,0),\"\")","v":""},{"$f":"IFERROR(VLOOKUP($D113,prezence!A:F,6,0),\"\")","v":""}]
[109,null,-0.011921296296296298,null,{"$f":"IFERROR(VLOOKUP($D114,prezence!A:F,2,0),\"\")","v":""},{"$f":"IFERROR(VLOOKUP($D114,prezence!A:F,3,0),\"\")","v":""},{"$f":"IFERROR(VLOOKUP($D114,prezence!A:F,4,0),\"\")","v":""},{"$f":"IFERROR(VLOOKUP($D114,prezence!A:F,5,0),\"\")","v":""},{"$f":"IFERROR(VLOOKUP($D114,prezence!A:F,6,0),\"\")","v":""}]
[110,null,-0.011921296296296298,null,{"$f":"IFERROR(VLOOKUP($D115,prezence!A:F,2,0),\"\")","v":""},{"$f":"IFERROR(VLOOKUP($D115,prezence!A:F,3,0),\"\")","v":""},{"$f":"IFERROR(VLOOKUP($D115,prezence!A:F,4,0),\"\")","v":""},{"$f":"IFERROR(VLOOKUP($D115,prezence!A:F,5,0),\"\")","v":""},{"$f":"IFERROR(VLOOKUP($D115,prezence!A:F,6,0),\"\")","v":""}]
[111,null,-0.011921296296296298,null,{"$f":"IFERROR(VLOOKUP($D116,prezence!A:F,2,0),\"\")","v":""},{"$f":"IFERROR(VLOOKUP($D116,prezence!A:F,3,0),\"\")","v":""},{"$f":"IFERROR(VLOOKUP($D116,prezence!A:F,4,0),\"\")","v":""},{"$f":"IFERROR(VLOOKUP($D116,prezence!A:F,5,0),\"\")","v":""},{"$f":"IFERROR(VLOOKUP($D116,prezence!A:F,6,0),\"\")","v":""}]
[112,null,-0.011921296296296298,null,{"$f":"IFERROR(VLOOKUP($D117,prezence!A:F,2,0),\"\")","v":""},{"$f":"IFERROR(VLOOKUP($D117,prezence!A:F,3,0),\"\")","v":""},{"$f":"IFERROR(VLOOKUP($D117,prezence!A:F,4,0),\"\")","v":""},{"$f":"IFERROR(VLOOKUP($D117,prezence!A:F,5,0),\"\")","v":""},{"$f":"IFERROR(VLOOKUP($D117,prezence!A:F,6,0),\"\")","v":""}]
[113,null,-0.011921296296296298,null,{"$f":"IFERROR(VLOOKUP($D118,prezence!A:F,2,0),\"\")","v":""},{"$f":"IFERROR(VLOOKUP($D118,prezence!A:F,3,0),\"\")","v":""},{"$f":"IFERROR(VLOOKUP($D118,prezence!A:F,4,0),\"\")","v":""},{"$f":"IFERROR(VLOOKUP($D118,prezence!A:F,5,0),\"\")","v":""},{"$f":"IFERROR(VLOOKUP($D118,prezence!A:F,6,0),\"\")","v":""}]
[114,null,-0.011921296296296298,null,{"$f":"IFERROR(VLOOKUP($D119,prezence!A:F,2,0),\"\")","v":""},{"$f":"IFERROR(VLOOKUP($D119,prezence!A:F,3,0),\"\")","v":""},{"$f":"IFERROR(VLOOKUP($D119,prezence!A:F,4,0),\"\")","v":""},{"$f":"IFERROR(VLOOKUP($D119,prezence!A:F,5,0),\"\")","v":""},{"$f":"IFERROR(VLOOKUP($D119,prezence!A:F,6,0),\"\")","v":""}]
[115,null,-0.011921296296296298,null,{"$f":"IFERROR(VLOOKUP($D120,prezence!A:F,2,0),\"\")","v":""},{"$f":"IFERROR(VLOOKUP($D120,prezence!A:F,3,0),\"\")","v":""},{"$f":"IFERROR(VLOOKUP($D120,prezence!A:F,4,0),\"\")","v":""},{"$f":"IFERROR(VLOOKUP($D120,prezence!A:F,5,0),\"\")","v":""},{"$f":"IFERROR(VLOOKUP($D120,prezence!A:F,6,0),\"\")","v":""}]
[116,null,-0.011921296296296298,null,{"$f":"IFERROR(VLOOKUP($D121,prezence!A:F,2,0),\"\")","v":""},{"$f":"IFERROR(VLOOKUP($D121,prezence!A:F,3,0),\"\")","v":""},{"$f":"IFERROR(VLOOKUP($D121,prezence!A:F,4,0),\"\")","v":""},{"$f":"IFERROR(VLOOKUP($D121,prezence!A:F,5,0),\"\")","v":""},{"$f":"IFERROR(VLOOKUP($D121,prezence!A:F,6,0),\"\")","v":""}]
[117,null,-0.011921296296296298,null,{"$f":"IFERROR(VLOOKUP($D122,prezence!A:F,2,0),\"\")","v":""},{"$f":"IFERROR(VLOOKUP($D122,prezence!A:F,3,0),\"\")","v":""},{"$f":"IFERROR(VLOOKUP($D122,prezence!A:F,4,0),\"\")","v":""},{"$f":"IFERROR(VLOOKUP($D122,prezence!A:F,5,0),\"\")","v":""},{"$f":"IFERROR(VLOOKUP($D122,prezence!A:F,6,0),\"\")","v":""}]
[118,null,-0.011921296296296298,null,{"$f":"IFERROR(VLOOKUP($D123,prezence!A:F,2,0),\"\")","v":""},{"$f":"IFERROR(VLOOKUP($D123,prezence!A:F,3,0),\"\")","v":""},{"$f":"IFERROR(VLOOKUP($D123,prezence!A:F,4,0),\"\")","v":""},{"$f":"IFERROR(VLOOKUP($D123,prezence!A:F,5,0),\"\")","v":""},{"$f":"IFERROR(VLOOKUP($D123,prezence!A:F,6,0),\"\")","v":""}]
[119,null,-0.011921296296296298,null,{"$f":"IFERROR(VLOOKUP($D124,prezence!A:F,2,0),\"\")","v":""},{"$f":"IFERROR(VLOOKUP($D124,prezence!A:F,3,0),\"\")","v":""},{"$f":"IFERROR(VLOOKUP($D124,prezence!A:F,4,0),\"\")","v":""},{"$f":"IFERROR(VLOOKUP($D124,prezence!A:F,5,0),\"\")","v":""},{"$f":"IFERROR(VLOOKUP($D124,prezence!A:F,6,0),\"\")","v":""}]
[120,null,-0.011921296296296298,null,{"$f":"IFERROR(VLOOKUP($D125,prezence!A:F,2,0),\"\")","v":""},{"$f":"IFERROR(VLOOKUP($D125,prezence!A:F,3,0),\"\")","v":""},{"$f":"IFERROR(VLOOKUP($D125,prezence!A:F,4,0),\"\")","v":""},{"$f":"IFERROR(VLOOKUP($D125,prezence!A:F,5,0),\"\")","v":""},{"$f":"IFERROR(VLOOKUP($D125,prezence!A:F,6,0),\"\")","v":""}]
[121,null,-0.011921296296296298,null,{"$f":"IFERROR(VLOOKUP($D126,prezence!A:F,2,0),\"\")","v":""},{"$f":"IFERROR(VLOOKUP($D126,prezence!A:F,3,0),\"\")","v":""},{"$f":"IFERROR(VLOOKUP($D126,prezence!A:F,4,0),\"\")","v":""},{"$f":"IFERROR(VLOOKUP($D126,prezence!A:F,5,0),\"\")","v":""},{"$f":"IFERROR(VLOOKUP($D126,prezence!A:F,6,0),\"\")","v":""}]
[122,null,-0.011921296296296298,null,{"$f":"IFERROR(VLOOKUP($D127,prezence!A:F,2,0),\"\")","v":""},{"$f":"IFERROR(VLOOKUP($D127,prezence!A:F,3,0),\"\")","v":""},{"$f":"IFERROR(VLOOKUP($D127,prezence!A:F,4,0),\"\")","v":""},{"$f":"IFERROR(VLOOKUP($D127,prezence!A:F,5,0),\"\")","v":""},{"$f":"IFERROR(VLOOKUP($D127,prezence!A:F,6,0),\"\")","v":""}]
[123,null,-0.011921296296296298,null,{"$f":"IFERROR(VLOOKUP($D128,prezence!A:F,2,0),\"\")","v":""},{"$f":"IFERROR(VLOOKUP($D128,prezence!A:F,3,0),\"\")","v":""},{"$f":"IFERROR(VLOOKUP($D128,prezence!A:F,4,0),\"\")","v":""},{"$f":"IFERROR(VLOOKUP($D128,prezence!A:F,5,0),\"\")","v":""},{"$f":"IFERROR(VLOOKUP($D128,prezence!A:F,6,0),\"\")","v":""}]
[124,null,-0.011921296296296298,null,{"$f":"IFERROR(VLOOKUP($D129,prezence!A:F,2,0),\"\")","v":""},{"$f":"IFERROR(VLOOKUP($D129,prezence!A:F,3,0),\"\")","v":""},{"$f":"IFERROR(VLOOKUP($D129,prezence!A:F,4,0),\"\")","v":""},{"$f":"IFERROR(VLOOKUP($D129,prezence!A:F,5,0),\"\")","v":""},{"$f":"IFERROR(VLOOKUP($D129,prezence!A:F,6,0),\"\")","v":""}]
[125,null,-0.011921296296296298,null,{"$f":"IFERROR(VLOOKUP($D130,prezence!A:F,2,0),\"\")","v":""},{"$f":"IFERROR(VLOOKUP($D130,prezence!A:F,3,0),\"\")","v":""},{"$f":"IFERROR(VLOOKUP($D130,prezence!A:F,4,0),\"\")","v":""},{"$f":"IFERROR(VLOOKUP($D130,prezence!A:F,5,0),\"\")","v":""},{"$f":"IFERROR(VLOOKUP($D130,prezence!A:F,6,0),\"\")","v":""}]
[126,null,-0.011921296296296298,null,{"$f":"IFERROR(VLOOKUP($D131,prezence!A:F,2,0),\"\")","v":""},{"$f":"IFERROR(VLOOKUP($D131,prezence!A:F,3,0),\"\")","v":""},{"$f":"IFERROR(VLOOKUP($D131,prezence!A:F,4,0),\"\")","v":""},{"$f":"IFERROR(VLOOKUP($D131,prezence!A:F,5,0),\"\")","v":""},{"$f":"IFERROR(VLOOKUP($D131,prezence!A:F,6,0),\"\")","v":""}]
[127,null,-0.011921296296296298,null,{"$f":"IFERROR(VLOOKUP($D132,prezence!A:F,2,0),\"\")","v":""},{"$f":"IFERROR(VLOOKUP($D132,prezence!A:F,3,0),\"\")","v":""},{"$f":"IFERROR(VLOOKUP($D132,prezence!A:F,4,0),\"\")","v":""},{"$f":"IFERROR(VLOOKUP($D132,prezence!A:F,5,0),\"\")","v":""},{"$f":"IFERROR(VLOOKUP($D132,prezence!A:F,6,0),\"\")","v":""}]
[128,null,-0.011921296296296298,null,{"$f":"IFERROR(VLOOKUP($D133,prezence!A:F,2,0),\"\")","v":""},{"$f":"IFERROR(VLOOKUP($D133,prezence!A:F,3,0),\"\")","v":""},{"$f":"IFERROR(VLOOKUP($D133,prezence!A:F,4,0),\"\")","v":""},{"$f":"IFERROR(VLOOKUP($D133,prezence!A:F,5,0),\"\")","v":""},{"$f":"IFERROR(VLOOKUP($D133,prezence!A:F,6,0),\"\")","v":""}]
[129,null,{"$f":"B134-$B$6","v":-0.011921296296296298},null,{"$f":"IFERROR(VLOOKUP($D134,prezence!A:F,2,0),\"\")","v":""},{"$f":"IFERROR(VLOOKUP($D134,prezence!A:F,3,0),\"\")","v":""},{"$f":"IFERROR(VLOOKUP($D134,prezence!A:F,4,0),\"\")","v":""},{"$f":"IFERROR(VLOOKUP($D134,prezence!A:F,5,0),\"\")","v":""},{"$f":"IFERROR(VLOOKUP($D134,prezence!A:F,6,0),\"\")","v":""}]
[130,null,-0.011921296296296298,null,{"$f":"IFERROR(VLOOKUP($D135,prezence!A:F,2,0),\"\")","v":""},{"$f":"IFERROR(VLOOKUP($D135,prezence!A:F,3,0),\"\")","v":""},{"$f":"IFERROR(VLOOKUP($D135,prezence!A:F,4,0),\"\")","v":""},{"$f":"IFERROR(VLOOKUP($D135,prezence!A:F,5,0),\"\")","v":""},{"$f":"IFERROR(VLOOKUP($D135,prezence!A:F,6,0),\"\")","v":""}]
[131,null,-0.011921296296296298,null,{"$f":"IFERROR(VLOOKUP($D136,prezence!A:F,2,0),\"\")","v":""},{"$f":"IFERROR(VLOOKUP($D136,prezence!A:F,3,0),\"\")","v":""},{"$f":"IFERROR(VLOOKUP($D136,prezence!A:F,4,0),\"\")","v":""},{"$f":"IFERROR(VLOOKUP($D136,prezence!A:F,5,0),\"\")","v":""},{"$f":"IFERROR(VLOOKUP($D136,prezence!A:F,6,0),\"\")","v":""}]
[132,null,-0.011921296296296298,null,{"$f":"IFERROR(VLOOKUP($D137,prezence!A:F,2,0),\"\")","v":""},{"$f":"IFERROR(VLOOKUP($D137,prezence!A:F,3,0),\"\")","v":""},{"$f":"IFERROR(VLOOKUP($D137,prezence!A:F,4,0),\"\")","v":""},{"$f":"IFERROR(VLOOKUP($D137,prezence!A:F,5,0),\"\")","v":""},{"$f":"IFERROR(VLOOKUP($D137,prezence!A:F,6,0),\"\")","v":""}]
[133,null,-0.011921296296296298,null,{"$f":"IFERROR(VLOOKUP($D138,prezence!A:F,2,0),\"\")","v":""},{"$f":"IFERROR(VLOOKUP($D138,prezence!A:F,3,0),\"\")","v":""},{"$f":"IFERROR(VLOOKUP($D138,prezence!A:F,4,0),\"\")","v":""},{"$f":"IFERROR(VLOOKUP($D138,prezence!A:F,5,0),\"\")","v":""},{"$f":"IFERROR(VLOOKUP($D138,prezence!A:F,6,0),\"\")","v":""}]
[134,null,-0.011921296296296298,null,{"$f":"IFERROR(VLOOKUP($D139,prezence!A:F,2,0),\"\")","v":""},{"$f":"IFERROR(VLOOKUP($D139,prezence!A:F,3,0),\"\")","v":""},{"$f":"IFERROR(VLOOKUP($D139,prezence!A:F,4,0),\"\")","v":""},{"$f":"IFERROR(VLOOKUP($D139,prezence!A:F,5,0),\"\")","v":""},{"$f":"IFERROR(VLOOKUP($D139,prezence!A:F,6,0),\"\")","v":""}]
[135,null,-0.011921296296296298,null,{"$f":"IFERROR(VLOOKUP($D140,prezence!A:F,2,0),\"\")","v":""},{"$f":"IFERROR(VLOOKUP($D140,prezence!A:F,3,0),\"\")","v":""},{"$f":"IFERROR(VLOOKUP($D140,prezence!A:F,4,0),\"\")","v":""},{"$f":"IFERROR(VLOOKUP($D140,prezence!A:F,5,0),\"\")","v":""},{"$f":"IFERROR(VLOOKUP($D140,prezence!A:F,6,0),\"\")","v":""}]
[136,null,-0.011921296296296298,null,{"$f":"IFERROR(VLOOKUP($D141,prezence!A:F,2,0),\"\")","v":""},{"$f":"IFERROR(VLOOKUP($D141,prezence!A:F,3,0),\"\")","v":""},{"$f":"IFERROR(VLOOKUP($D141,prezence!A:F,4,0),\"\")","v":""},{"$f":"IFERROR(VLOOKUP($D141,prezence!A:F,5,0),\"\")","v":""},{"$f":"IFERROR(VLOOKUP($D141,prezence!A:F,6,0),\"\")","v":""}]
[137,null,-0.011921296296296298,null,{"$f":"IFERROR(VLOOKUP($D142,prezence!A:F,2,0),\"\")","v":""},{"$f":"IFERROR(VLOOKUP($D142,prezence!A:F,3,0),\"\")","v":""},{"$f":"IFERROR(VLOOKUP($D142,prezence!A:F,4,0),\"\")","v":""},{"$f":"IFERROR(VLOOKUP($D142,prezence!A:F,5,0),\"\")","v":""},{"$f":"IFERROR(VLOOKUP($D142,prezence!A:F,6,0),\"\")","v":""}]
[138,null,-0.011921296296296298,null,{"$f":"IFERROR(VLOOKUP($D143,prezence!A:F,2,0),\"\")","v":""},{"$f":"IFERROR(VLOOKUP($D143,prezence!A:F,3,0),\"\")","v":""},{"$f":"IFERROR(VLOOKUP($D143,prezence!A:F,4,0),\"\")","v":""},{"$f":"IFERROR(VLOOKUP($D143,prezence!A:F,5,0),\"\")","v":""},{"$f":"IFERROR(VLOOKUP($D143,prezence!A:F,6,0),\"\")","v":""}]
[139,null,-0.011921296296296298,null,{"$f":"IFERROR(VLOOKUP($D144,prezence!A:F,2,0),\"\")","v":""},{"$f":"IFERROR(VLOOKUP($D144,prezence!A:F,3,0),\"\")","v":""},{"$f":"IFERROR(VLOOKUP($D144,prezence!A:F,4,0),\"\")","v":""},{"$f":"IFERROR(VLOOKUP($D144,prezence!A:F,5,0),\"\")","v":""},{"$f":"IFERROR(VLOOKUP($D144,prezence!A:F,6,0),\"\")","v":""}]
[140,null,-0.011921296296296298,null,{"$f":"IFERROR(VLOOKUP($D145,prezence!A:F,2,0),\"\")","v":""},{"$f":"IFERROR(VLOOKUP($D145,prezence!A:F,3,0),\"\")","v":""},{"$f":"IFERROR(VLOOKUP($D145,prezence!A:F,4,0),\"\")","v":""},{"$f":"IFERROR(VLOOKUP($D145,prezence!A:F,5,0),\"\")","v":""},{"$f":"IFERROR(VLOOKUP($D145,prezence!A:F,6,0),\"\")","v":""}]
[141,null,-0.011921296296296298,null,{"$f":"IFERROR(VLOOKUP($D146,prezence!A:F,2,0),\"\")","v":""},{"$f":"IFERROR(VLOOKUP($D146,prezence!A:F,3,0),\"\")","v":""},{"$f":"IFERROR(VLOOKUP($D146,prezence!A:F,4,0),\"\")","v":""},{"$f":"IFERROR(VLOOKUP($D146,prezence!A:F,5,0),\"\")","v":""},{"$f":"IFERROR(VLOOKUP($D146,prezence!A:F,6,0),\"\")","v":""}]
[142,null,-0.011921296296296298,null,{"$f":"IFERROR(VLOOKUP($D147,prezence!A:F,2,0),\"\")","v":""},{"$f":"IFERROR(VLOOKUP($D147,prezence!A:F,3,0),\"\")","v":""},{"$f":"IFERROR(VLOOKUP($D147,prezence!A:F,4,0),\"\")","v":""},{"$f":"IFERROR(VLOOKUP($D147,prezence!A:F,5,0),\"\")","v":""},{"$f":"IFERROR(VLOOKUP($D147,prezence!A:F,6,0),\"\")","v":""}]
[143,null,-0.011921296296296298,null,{"$f":"IFERROR(VLOOKUP($D148,prezence!A:F,2,0),\"\")","v":""},{"$f":"IFERROR(VLOOKUP($D148,prezence!A:F,3,0),\"\")","v":""},{"$f":"IFERROR(VLOOKUP($D148,prezence!A:F,4,0),\"\")","v":""},{"$f":"IFERROR(VLOOKUP($D148,prezence!A:F,5,0),\"\")","v":""},{"$f":"IFERROR(VLOOKUP($D148,prezence!A:F,6,0),\"\")","v":""}]
[144,null,-0.011921296296296298,null,{"$f":"IFERROR(VLOOKUP($D149,prezence!A:F,2,0),\"\")","v":""},{"$f":"IFERROR(VLOOKUP($D149,prezence!A:F,3,0),\"\")","v":""},{"$f":"IFERROR(VLOOKUP($D149,prezence!A:F,4,0),\"\")","v":""},{"$f":"IFERROR(VLOOKUP($D149,prezence!A:F,5,0),\"\")","v":""},{"$f":"IFERROR(VLOOKUP($D149,prezence!A:F,6,0),\"\")","v":""}]
[145,null,-0.011921296296296298,null,{"$f":"IFERROR(VLOOKUP($D150,prezence!A:F,2,0),\"\")","v":""},{"$f":"IFERROR(VLOOKUP($D150,prezence!A:F,3,0),\"\")","v":""},{"$f":"IFERROR(VLOOKUP($D150,prezence!A:F,4,0),\"\")","v":""},{"$f":"IFERROR(VLOOKUP($D150,prezence!A:F,5,0),\"\")","v":""},{"$f":"IFERROR(VLOOKUP($D150,prezence!A:F,6,0),\"\")","v":""}]
[146,null,-0.011921296296296298,null,{"$f":"IFERROR(VLOOKUP($D151,prezence!A:F,2,0),\"\")","v":""},{"$f":"IFERROR(VLOOKUP($D151,prezence!A:F,3,0),\"\")","v":""},{"$f":"IFERROR(VLOOKUP($D151,prezence!A:F,4,0),\"\")","v":""},{"$f":"IFERROR(VLOOKUP($D151,prezence!A:F,5,0),\"\")","v":""},{"$f":"IFERROR(VLOOKUP($D151,prezence!A:F,6,0),\"\")","v":""}]
[147,null,-0.011921296296296298,null,{"$f":"IFERROR(VLOOKUP($D152,prezence!A:F,2,0),\"\")","v":""},{"$f":"IFERROR(VLOOKUP($D152,prezence!A:F,3,0),\"\")","v":""},{"$f":"IFERROR(VLOOKUP($D152,prezence!A:F,4,0),\"\")","v":""},{"$f":"IFERROR(VLOOKUP($D152,prezence!A:F,5,0),\"\")","v":""},{"$f":"IFERROR(VLOOKUP($D152,prezence!A:F,6,0),\"\")","v":""}]
[148,null,-0.011921296296296298,null,{"$f":"IFERROR(VLOOKUP($D153,prezence!A:F,2,0),\"\")","v":""},{"$f":"IFERROR(VLOOKUP($D153,prezence!A:F,3,0),\"\")","v":""},{"$f":"IFERROR(VLOOKUP($D153,prezence!A:F,4,0),\"\")","v":""},{"$f":"IFERROR(VLOOKUP($D153,prezence!A:F,5,0),\"\")","v":""},{"$f":"IFERROR(VLOOKUP($D153,prezence!A:F,6,0),\"\")","v":""}]
[149,null,-0.011921296296296298,null,{"$f":"IFERROR(VLOOKUP($D154,prezence!A:F,2,0),\"\")","v":""},{"$f":"IFERROR(VLOOKUP($D154,prezence!A:F,3,0),\"\")","v":""},{"$f":"IFERROR(VLOOKUP($D154,prezence!A:F,4,0),\"\")","v":""},{"$f":"IFERROR(VLOOKUP($D154,prezence!A:F,5,0),\"\")","v":""},{"$f":"IFERROR(VLOOKUP($D154,prezence!A:F,6,0),\"\")","v":""}]
[150,null,-0.011921296296296298,null,{"$f":"IFERROR(VLOOKUP($D155,prezence!A:F,2,0),\"\")","v":""},{"$f":"IFERROR(VLOOKUP($D155,prezence!A:F,3,0),\"\")","v":""},{"$f":"IFERROR(VLOOKUP($D155,prezence!A:F,4,0),\"\")","v":""},{"$f":"IFERROR(VLOOKUP($D155,prezence!A:F,5,0),\"\")","v":""},{"$f":"IFERROR(VLOOKUP($D155,prezence!A:F,6,0),\"\")","v":""}]
[151,null,-0.011921296296296298,null,{"$f":"IFERROR(VLOOKUP($D156,prezence!A:F,2,0),\"\")","v":""},{"$f":"IFERROR(VLOOKUP($D156,prezence!A:F,3,0),\"\")","v":""},{"$f":"IFERROR(VLOOKUP($D156,prezence!A:F,4,0),\"\")","v":""},{"$f":"IFERROR(VLOOKUP($D156,prezence!A:F,5,0),\"\")","v":""},{"$f":"IFERROR(VLOOKUP($D156,prezence!A:F,6,0),\"\")","v":""}]
[152,null,-0.011921296296296298,null,{"$f":"IFERROR(VLOOKUP($D157,prezence!A:F,2,0),\"\")","v":""},{"$f":"IFERROR(VLOOKUP($D157,prezence!A:F,3,0),\"\")","v":""},{"$f":"IFERROR(VLOOKUP($D157,prezence!A:F,4,0),\"\")","v":""},{"$f":"IFERROR(VLOOKUP($D157,prezence!A:F,5,0),\"\")","v":""},{"$f":"IFERROR(VLOOKUP($D157,prezence!A:F,6,0),\"\")","v":""}]
[153,null,-0.011921296296296298,null,{"$f":"IFERROR(VLOOKUP($D158,prezence!A:F,2,0),\"\")","v":""},{"$f":"IFERROR(VLOOKUP($D158,prezence!A:F,3,0),\"\")","v":""},{"$f":"IFERROR(VLOOKUP($D158,prezence!A:F,4,0),\"\")","v":""},{"$f":"IFERROR(VLOOKUP($D158,prezence!A:F,5,0),\"\")","v":""},{"$f":"IFERROR(VLOOKUP($D158,prezence!A:F,6,0),\"\")","v":""}]
[154,null,-0.011921296296296298,null,{"$f":"IFERROR(VLOOKUP($D159,prezence!A:F,2,0),\"\")","v":""},{"$f":"IFERROR(VLOOKUP($D159,prezence!A:F,3,0),\"\")","v":""},{"$f":"IFERROR(VLOOKUP($D159,prezence!A:F,4,0),\"\")","v":""},{"$f":"IFERROR(VLOOKUP($D159,prezence!A:F,5,0),\"\")","v":""},{"$f":"IFERROR(VLOOKUP($D159,prezence!A:F,6,0),\"\")","v":""}]
[155,null,-0.011921296296296298,null,{"$f":"IFERROR(VLOOKUP($D160,prezence!A:F,2,0),\"\")","v":""},{"$f":"IFERROR(VLOOKUP($D160,prezence!A:F,3,0),\"\")","v":""},{"$f":"IFERROR(VLOOKUP($D160,prezence!A:F,4,0),\"\")","v":""},{"$f":"IFERROR(VLOOKUP($D160,prezence!A:F,5,0),\"\")","v":""},{"$f":"IFERROR(VLOOKUP($D160,prezence!A:F,6,0),\"\")","v":""}]
[156,null,-0.011921296296296298,null,{"$f":"IFERROR(VLOOKUP($D161,prezence!A:F,2,0),\"\")","v":""},{"$f":"IFERROR(VLOOKUP($D161,prezence!A:F,3,0),\"\")","v":""},{"$f":"IFERROR(VLOOKUP($D161,prezence!A:F,4,0),\"\")","v":""},{"$f":"IFERROR(VLOOKUP($D161,prezence!A:F,5,0),\"\")","v":""},{"$f":"IFERROR(VLOOKUP($D161,prezence!A:F,6,0),\"\")","v":""}]
[157,null,-0.011921296296296298,null,{"$f":"IFERROR(VLOOKUP($D162,prezence!A:F,2,0),\"\")","v":""},{"$f":"IFERROR(VLOOKUP($D162,prezence!A:F,3,0),\"\")","v":""},{"$f":"IFERROR(VLOOKUP($D162,prezence!A:F,4,0),\"\")","v":""},{"$f":"IFERROR(VLOOKUP($D162,prezence!A:F,5,0),\"\")","v":""},{"$f":"IFERROR(VLOOKUP($D162,prezence!A:F,6,0),\"\")","v":""}]
[158,null,-0.011921296296296298,null,{"$f":"IFERROR(VLOOKUP($D163,prezence!A:F,2,0),\"\")","v":""},{"$f":"IFERROR(VLOOKUP($D163,prezence!A:F,3,0),\"\")","v":""},{"$f":"IFERROR(VLOOKUP($D163,prezence!A:F,4,0),\"\")","v":""},{"$f":"IFERROR(VLOOKUP($D163,prezence!A:F,5,0),\"\")","v":""},{"$f":"IFERROR(VLOOKUP($D163,prezence!A:F,6,0),\"\")","v":""}]
[159,null,-0.011921296296296298,null,{"$f":"IFERROR(VLOOKUP($D164,prezence!A:F,2,0),\"\")","v":""},{"$f":"IFERROR(VLOOKUP($D164,prezence!A:F,3,0),\"\")","v":""},{"$f":"IFERROR(VLOOKUP($D164,prezence!A:F,4,0),\"\")","v":""},{"$f":"IFERROR(VLOOKUP($D164,prezence!A:F,5,0),\"\")","v":""},{"$f":"IFERROR(VLOOKUP($D164,prezence!A:F,6,0),\"\")","v":""}]
[160,null,-0.011921296296296298,null,{"$f":"IFERROR(VLOOKUP($D165,prezence!A:F,2,0),\"\")","v":""},{"$f":"IFERROR(VLOOKUP($D165,prezence!A:F,3,0),\"\")","v":""},{"$f":"IFERROR(VLOOKUP($D165,prezence!A:F,4,0),\"\")","v":""},{"$f":"IFERROR(VLOOKUP($D165,prezence!A:F,5,0),\"\")","v":""},{"$f":"IFERROR(VLOOKUP($D165,prezence!A:F,6,0),\"\")","v":""}]
[161,null,-0.011921296296296298,null,{"$f":"IFERROR(VLOOKUP($D166,prezence!A:F,2,0),\"\")","v":""},{"$f":"IFERROR(VLOOKUP($D166,prezence!A:F,3,0),\"\")","v":""},{"$f":"IFERROR(VLOOKUP($D166,prezence!A:F,4,0),\"\")","v":""},{"$f":"IFERROR(VLOOKUP($D166,prezence!A:F,5,0),\"\")","v":""},{"$f":"IFERROR(VLOOKUP($D166,prezence!A:F,6,0),\"\")","v":""}]
[162,null,-0.011921296296296298,null,{"$f":"IFERROR(VLOOKUP($D167,prezence!A:F,2,0),\"\")","v":""},{"$f":"IFERROR(VLOOKUP($D167,prezence!A:F,3,0),\"\")","v":""},{"$f":"IFERROR(VLOOKUP($D167,prezence!A:F,4,0),\"\")","v":""},{"$f":"IFERROR(VLOOKUP($D167,prezence!A:F,5,0),\"\")","v":""},{"$f":"IFERROR(VLOOKUP($D167,prezence!A:F,6,0),\"\")","v":""}]
[163,null,-0.011921296296296298,null,{"$f":"IFERROR(VLOOKUP($D168,prezence!A:F,2,0),\"\")","v":""},{"$f":"IFERROR(VLOOKUP($D168,prezence!A:F,3,0),\"\")","v":""},{"$f":"IFERROR(VLOOKUP($D168,prezence!A:F,4,0),\"\")","v":""},{"$f":"IFERROR(VLOOKUP($D168,prezence!A:F,5,0),\"\")","v":""},{"$f":"IFERROR(VLOOKUP($D168,prezence!A:F,6,0),\"\")","v":""}]
[164,null,-0.011921296296296298,null,{"$f":"IFERROR(VLOOKUP($D169,prezence!A:F,2,0),\"\")","v":""},{"$f":"IFERROR(VLOOKUP($D169,prezence!A:F,3,0),\"\")","v":""},{"$f":"IFERROR(VLOOKUP($D169,prezence!A:F,4,0),\"\")","v":""},{"$f":"IFERROR(VLOOKUP($D169,prezence!A:F,5,0),\"\")","v":""},{"$f":"IFERROR(VLOOKUP($D169,prezence!A:F,6,0),\"\")","v":""}]
[165,null,-0.011921296296296298,null,{"$f":"IFERROR(VLOOKUP($D170,prezence!A:F,2,0),\"\")","v":""},{"$f":"IFERROR(VLOOKUP($D170,prezence!A:F,3,0),\"\")","v":""},{"$f":"IFERROR(VLOOKUP($D170,prezence!A:F,4,0),\"\")","v":""},{"$f":"IFERROR(VLOOKUP($D170,prezence!A:F,5,0),\"\")","v":""},{"$f":"IFERROR(VLOOKUP($D170,prezence!A:F,6,0),\"\")","v":""}]
[166,null,-0.011921296296296298,null,{"$f":"IFERROR(VLOOKUP($D171,prezence!A:F,2,0),\"\")","v":""},{"$f":"IFERROR(VLOOKUP($D171,prezence!A:F,3,0),\"\")","v":""},{"$f":"IFERROR(VLOOKUP($D171,prezence!A:F,4,0),\"\")","v":""},{"$f":"IFERROR(VLOOKUP($D171,prezence!A:F,5,0),\"\")","v":""},{"$f":"IFERROR(VLOOKUP($D171,prezence!A:F,6,0),\"\")","v":""}]
[167,null,-0.011921296296296298,null,{"$f":"IFERROR(VLOOKUP($D172,prezence!A:F,2,0),\"\")","v":""},{"$f":"IFERROR(VLOOKUP($D172,prezence!A:F,3,0),\"\")","v":""},{"$f":"IFERROR(VLOOKUP($D172,prezence!A:F,4,0),\"\")","v":""},{"$f":"IFERROR(VLOOKUP($D172,prezence!A:F,5,0),\"\")","v":""},{"$f":"IFERROR(VLOOKUP($D172,prezence!A:F,6,0),\"\")","v":""}]
[168,null,-0.011921296296296298,null,{"$f":"IFERROR(VLOOKUP($D173,prezence!A:F,2,0),\"\")","v":""},{"$f":"IFERROR(VLOOKUP($D173,prezence!A:F,3,0),\"\")","v":""},{"$f":"IFERROR(VLOOKUP($D173,prezence!A:F,4,0),\"\")","v":""},{"$f":"IFERROR(VLOOKUP($D173,prezence!A:F,5,0),\"\")","v":""},{"$f":"IFERROR(VLOOKUP($D173,prezence!A:F,6,0),\"\")","v":""}]
[169,null,-0.011921296296296298,null,{"$f":"IFERROR(VLOOKUP($D174,prezence!A:F,2,0),\"\")","v":""},{"$f":"IFERROR(VLOOKUP($D174,prezence!A:F,3,0),\"\")","v":""},{"$f":"IFERROR(VLOOKUP($D174,prezence!A:F,4,0),\"\")","v":""},{"$f":"IFERROR(VLOOKUP($D174,prezence!A:F,5,0),\"\")","v":""},{"$f":"IFERROR(VLOOKUP($D174,prezence!A:F,6,0),\"\")","v":""}]
[170,null,-0.011921296296296298,null,{"$f":"IFERROR(VLOOKUP($D175,prezence!A:F,2,0),\"\")","v":""},{"$f":"IFERROR(VLOOKUP($D175,prezence!A:F,3,0),\"\")","v":""},{"$f":"IFERROR(VLOOKUP($D175,prezence!A:F,4,0),\"\")","v":""},{"$f":"IFERROR(VLOOKUP($D175,prezence!A:F,5,0),\"\")","v":""},{"$f":"IFERROR(VLOOKUP($D175,prezence!A:F,6,0),\"\")","v":""}]
[171,null,-0.011921296296296298,null,{"$f":"IFERROR(VLOOKUP($D176,prezence!A:F,2,0),\"\")","v":""},{"$f":"IFERROR(VLOOKUP($D176,prezence!A:F,3,0),\"\")","v":""},{"$f":"IFERROR(VLOOKUP($D176,prezence!A:F,4,0),\"\")","v":""},{"$f":"IFERROR(VLOOKUP($D176,prezence!A:F,5,0),\"\")","v":""},{"$f":"IFERROR(VLOOKUP($D176,prezence!A:F,6,0),\"\")","v":""}]
[172,null,-0.011921296296296298,null,{"$f":"IFERROR(VLOOKUP($D177,prezence!A:F,2,0),\"\")","v":""},{"$f":"IFERROR(VLOOKUP($D177,prezence!A:F,3,0),\"\")","v":""},{"$f":"IFERROR(VLOOKUP($D177,prezence!A:F,4,0),\"\")","v":""},{"$f":"IFERROR(VLOOKUP($D177,prezence!A:F,5,0),\"\")","v":""},{"$f":"IFERROR(VLOOKUP($D177,prezence!A:F,6,0),\"\")","v":""}]
[173,null,-0.011921296296296298,null,{"$f":"IFERROR(VLOOKUP($D178,prezence!A:F,2,0),\"\")","v":""},{"$f":"IFERROR(VLOOKUP($D178,prezence!A:F,3,0),\"\")","v":""},{"$f":"IFERROR(VLOOKUP($D178,prezence!A:F,4,0),\"\")","v":""},{"$f":"IFERROR(VLOOKUP($D178,prezence!A:F,5,0),\"\")","v":""},{"$f":"IFERROR(VLOOKUP($D178,prezence!A:F,6,0),\"\")","v":""}]
[174,null,-0.011921296296296298,null,{"$f":"IFERROR(VLOOKUP($D179,prezence!A:F,2,0),\"\")","v":""},{"$f":"IFERROR(VLOOKUP($D179,prezence!A:F,3,0),\"\")","v":""},{"$f":"IFERROR(VLOOKUP($D179,prezence!A:F,4,0),\"\")","v":""},{"$f":"IFERROR(VLOOKUP($D179,prezence!A:F,5,0),\"\")","v":""},{"$f":"IFERROR(VLOOKUP($D179,prezence!A:F,6,0),\"\")","v":""}]
[175,null,-0.011921296296296298,null,{"$f":"IFERROR(VLOOKUP($D180,prezence!A:F,2,0),\"\")","v":""},{"$f":"IFERROR(VLOOKUP($D180,prezence!A:F,3,0),\"\")","v":""},{"$f":"IFERROR(VLOOKUP($D180,prezence!A:F,4,0),\"\")","v":""},{"$f":"IFERROR(VLOOKUP($D180,prezence!A:F,5,0),\"\")","v":""},{"$f":"IFERROR(VLOOKUP($D180,prezence!A:F,6,0),\"\")","v":""}]
[176,null,-0.011921296296296298,null,{"$f":"IFERROR(VLOOKUP($D181,prezence!A:F,2,0),\"\")","v":""},{"$f":"IFERROR(VLOOKUP($D181,prezence!A:F,3,0),\"\")","v":""},{"$f":"IFERROR(VLOOKUP($D181,prezence!A:F,4,0),\"\")","v":""},{"$f":"IFERROR(VLOOKUP($D181,prezence!A:F,5,0),\"\")","v":""},{"$f":"IFERROR(VLOOKUP($D181,prezence!A:F,6,0),\"\")","v":""}]
[177,null,-0.011921296296296298,null,{"$f":"IFERROR(VLOOKUP($D182,prezence!A:F,2,0),\"\")","v":""},{"$f":"IFERROR(VLOOKUP($D182,prezence!A:F,3,0),\"\")","v":""},{"$f":"IFERROR(VLOOKUP($D182,prezence!A:F,4,0),\"\")","v":""},{"$f":"IFERROR(VLOOKUP($D182,prezence!A:F,5,0),\"\")","v":""},{"$f":"IFERROR(VLOOKUP($D182,prezence!A:F,6,0),\"\")","v":""}]
[178,null,-0.011921296296296298,null,{"$f":"IFERROR(VLOOKUP($D183,prezence!A:F,2,0),\"\")","v":""},{"$f":"IFERROR(VLOOKUP($D183,prezence!A:F,3,0),\"\")","v":""},{"$f":"IFERROR(VLOOKUP($D183,prezence!A:F,4,0),\"\")","v":""},{"$f":"IFERROR(VLOOKUP($D183,prezence!A:F,5,0),\"\")","v":""},{"$f":"IFERROR(VLOOKUP($D183,prezence!A:F,6,0),\"\")","v":""}]
[179,null,-0.011921296296296298,null,{"$f":"IFERROR(VLOOKUP($D184,prezence!A:F,2,0),\"\")","v":""},{"$f":"IFERROR(VLOOKUP($D184,prezence!A:F,3,0),\"\")","v":""},{"$f":"IFERROR(VLOOKUP($D184,prezence!A:F,4,0),\"\")","v":""},{"$f":"IFERROR(VLOOKUP($D184,prezence!A:F,5,0),\"\")","v":""},{"$f":"IFERROR(VLOOKUP($D184,prezence!A:F,6,0),\"\")","v":""}]
[180,null,-0.011921296296296298,null,{"$f":"IFERROR(VLOOKUP($D185,prezence!A:F,2,0),\"\")","v":""},{"$f":"IFERROR(VLOOKUP($D185,prezence!A:F,3,0),\"\")","v":""},{"$f":"IFERROR(VLOOKUP($D185,prezence!A:F,4,0),\"\")","v":""},{"$f":"IFERROR(VLOOKUP($D185,prezence!A:F,5,0),\"\")","v":""},{"$f":"IFERROR(VLOOKUP($D185,prezence!A:F,6,0),\"\")","v":""}]
[181,null,-0.011921296296296298,null,{"$f":"IFERROR(VLOOKUP($D186,prezence!A:F,2,0),\"\")","v":""},{"$f":"IFERROR(VLOOKUP($D186,prezence!A:F,3,0),\"\")","v":""},{"$f":"IFERROR(VLOOKUP($D186,prezence!A:F,4,0),\"\")","v":""},{"$f":"IFERROR(VLOOKUP($D186,prezence!A:F,5,0),\"\")","v":""},{"$f":"IFERROR(VLOOKUP($D186,prezence!A:F,6,0),\"\")","v":""}]
[182,null,-0.011921296296296298,null,{"$f":"IFERROR(VLOOKUP($D187,prezence!A:F,2,0),\"\")","v":""},{"$f":"IFERROR(VLOOKUP($D187,prezence!A:F,3,0),\"\")","v":""},{"$f":"IFERROR(VLOOKUP($D187,prezence!A:F,4,0),\"\")","v":""},{"$f":"IFERROR(VLOOKUP($D187,prezence!A:F,5,0),\"\")","v":""},{"$f":"IFERROR(VLOOKUP($D187,prezence!A:F,6,0),\"\")","v":""}]
[183,null,-0.011921296296296298,null,{"$f":"IFERROR(VLOOKUP($D188,prezence!A:F,2,0),\"\")","v":""},{"$f":"IFERROR(VLOOKUP($D188,prezence!A:F,3,0),\"\")","v":""},{"$f":"IFERROR(VLOOKUP($D188,prezence!A:F,4,0),\"\")","v":""},{"$f":"IFERROR(VLOOKUP($D188,prezence!A:F,5,0),\"\")","v":""},{"$f":"IFERROR(VLOOKUP($D188,prezence!A:F,6,0),\"\")","v":""}]
[184,null,-0.011921296296296298,null,{"$f":"IFERROR(VLOOKUP($D189,prezence!A:F,2,0),\"\")","v":""},{"$f":"IFERROR(VLOOKUP($D189,prezence!A:F,3,0),\"\")","v":""},{"$f":"IFERROR(VLOOKUP($D189,prezence!A:F,4,0),\"\")","v":""},{"$f":"IFERROR(VLOOKUP($D189,prezence!A:F,5,0),\"\")","v":""},{"$f":"IFERROR(VLOOKUP($D189,prezence!A:F,6,0),\"\")","v":""}]
[185,null,-0.011921296296296298,null,{"$f":"IFERROR(VLOOKUP($D190,prezence!A:F,2,0),\"\")","v":""},{"$f":"IFERROR(VLOOKUP($D190,prezence!A:F,3,0),\"\")","v":""},{"$f":"IFERROR(VLOOKUP($D190,prezence!A:F,4,0),\"\")","v":""},{"$f":"IFERROR(VLOOKUP($D190,prezence!A:F,5,0),\"\")","v":""},{"$f":"IFERROR(VLOOKUP($D190,prezence!A:F,6,0),\"\")","v":""}]
[186,null,-0.011921296296296298,null,{"$f":"IFERROR(VLOOKUP($D191,prezence!A:F,2,0),\"\")","v":""},{"$f":"IFERROR(VLOOKUP($D191,prezence!A:F,3,0),\"\")","v":""},{"$f":"IFERROR(VLOOKUP($D191,prezence!A:F,4,0),\"\")","v":""},{"$f":"IFERROR(VLOOKUP($D191,prezence!A:F,5,0),\"\")","v":""},{"$f":"IFERROR(VLOOKUP($D191,prezence!A:F,6,0),\"\")","v":""}]
[187,null,-0.011921296296296298,null,{"$f":"IFERROR(VLOOKUP($D192,prezence!A:F,2,0),\"\")","v":""},{"$f":"IFERROR(VLOOKUP($D192,prezence!A:F,3,0),\"\")","v":""},{"$f":"IFERROR(VLOOKUP($D192,prezence!A:F,4,0),\"\")","v":""},{"$f":"IFERROR(VLOOKUP($D192,prezence!A:F,5,0),\"\")","v":""},{"$f":"IFERROR(VLOOKUP($D192,prezence!A:F,6,0),\"\")","v":""}]
[188,null,-0.011921296296296298,null,{"$f":"IFERROR(VLOOKUP($D193,prezence!A:F,2,0),\"\")","v":""},{"$f":"IFERROR(VLOOKUP($D193,prezence!A:F,3,0),\"\")","v":""},{"$f":"IFERROR(VLOOKUP($D193,prezence!A:F,4,0),\"\")","v":""},{"$f":"IFERROR(VLOOKUP($D193,prezence!A:F,5,0),\"\")","v":""},{"$f":"IFERROR(VLOOKUP($D193,prezence!A:F,6,0),\"\")","v":""}]
[189,null,-0.011921296296296298,null,{"$f":"IFERROR(VLOOKUP($D194,prezence!A:F,2,0),\"\")","v":""},{"$f":"IFERROR(VLOOKUP($D194,prezence!A:F,3,0),\"\")","v":""},{"$f":"IFERROR(VLOOKUP($D194,prezence!A:F,4,0),\"\")","v":""},{"$f":"IFERROR(VLOOKUP($D194,prezence!A:F,5,0),\"\")","v":""},{"$f":"IFERROR(VLOOKUP($D194,prezence!A:F,6,0),\"\")","v":""}]
[190,null,-0.011921296296296298,null,{"$f":"IFERROR(VLOOKUP($D195,prezence!A:F,2,0),\"\")","v":""},{"$f":"IFERROR(VLOOKUP($D195,prezence!A:F,3,0),\"\")","v":""},{"$f":"IFERROR(VLOOKUP($D195,prezence!A:F,4,0),\"\")","v":""},{"$f":"IFERROR(VLOOKUP($D195,prezence!A:F,5,0),\"\")","v":""},{"$f":"IFERROR(VLOOKUP($D195,prezence!A:F,6,0),\"\")","v":""}]
[191,null,-0.011921296296296298,null,{"$f":"IFERROR(VLOOKUP($D196,prezence!A:F,2,0),\"\")","v":""},{"$f":"IFERROR(VLOOKUP($D196,prezence!A:F,3,0),\"\")","v":""},{"$f":"IFERROR(VLOOKUP($D196,prezence!A:F,4,0),\"\")","v":""},{"$f":"IFERROR(VLOOKUP($D196,prezence!A:F,5,0),\"\")","v":""},{"$f":"IFERROR(VLOOKUP($D196,prezence!A:F,6,0),\"\")","v":""}]
[192,null,-0.011921296296296298,null,{"$f":"IFERROR(VLOOKUP($D197,prezence!A:F,2,0),\"\")","v":""},{"$f":"IFERROR(VLOOKUP($D197,prezence!A:F,3,0),\"\")","v":""},{"$f":"IFERROR(VLOOKUP($D197,prezence!A:F,4,0),\"\")","v":""},{"$f":"IFERROR(VLOOKUP($D197,prezence!A:F,5,0),\"\")","v":""},{"$f":"IFERROR(VLOOKUP($D197,prezence!A:F,6,0),\"\")","v":""}]
[193,null,{"$f":"B198-$B$6","v":-0.011921296296296298},null,{"$f":"IFERROR(VLOOKUP($D198,prezence!A:F,2,0),\"\")","v":""},{"$f":"IFERROR(VLOOKUP($D198,prezence!A:F,3,0),\"\")","v":""},{"$f":"IFERROR(VLOOKUP($D198,prezence!A:F,4,0),\"\")","v":""},{"$f":"IFERROR(VLOOKUP($D198,prezence!A:F,5,0),\"\")","v":""},{"$f":"IFERROR(VLOOKUP($D198,prezence!A:F,6,0),\"\")","v":""}]
[194,null,-0.011921296296296298,null,{"$f":"IFERROR(VLOOKUP($D199,prezence!A:F,2,0),\"\")","v":""},{"$f":"IFERROR(VLOOKUP($D199,prezence!A:F,3,0),\"\")","v":""},{"$f":"IFERROR(VLOOKUP($D199,prezence!A:F,4,0),\"\")","v":""},{"$f":"IFERROR(VLOOKUP($D199,prezence!A:F,5,0),\"\")","v":""},{"$f":"IFERROR(VLOOKUP($D199,prezence!A:F,6,0),\"\")","v":""}]
[195,null,-0.011921296296296298,null,{"$f":"IFERROR(VLOOKUP($D200,prezence!A:F,2,0),\"\")","v":""},{"$f":"IFERROR(VLOOKUP($D200,prezence!A:F,3,0),\"\")","v":""},{"$f":"IFERROR(VLOOKUP($D200,prezence!A:F,4,0),\"\")","v":""},{"$f":"IFERROR(VLOOKUP($D200,prezence!A:F,5,0),\"\")","v":""},{"$f":"IFERROR(VLOOKUP($D200,prezence!A:F,6,0),\"\")","v":""}]
[196,null,-0.011921296296296298,null,{"$f":"IFERROR(VLOOKUP($D201,prezence!A:F,2,0),\"\")","v":""},{"$f":"IFERROR(VLOOKUP($D201,prezence!A:F,3,0),\"\")","v":""},{"$f":"IFERROR(VLOOKUP($D201,prezence!A:F,4,0),\"\")","v":""},{"$f":"IFERROR(VLOOKUP($D201,prezence!A:F,5,0),\"\")","v":""},{"$f":"IFERROR(VLOOKUP($D201,prezence!A:F,6,0),\"\")","v":""}]
[197,null,-0.011921296296296298,null,{"$f":"IFERROR(VLOOKUP($D202,prezence!A:F,2,0),\"\")","v":""},{"$f":"IFERROR(VLOOKUP($D202,prezence!A:F,3,0),\"\")","v":""},{"$f":"IFERROR(VLOOKUP($D202,prezence!A:F,4,0),\"\")","v":""},{"$f":"IFERROR(VLOOKUP($D202,prezence!A:F,5,0),\"\")","v":""},{"$f":"IFERROR(VLOOKUP($D202,prezence!A:F,6,0),\"\")","v":""}]
[198,null,-0.011921296296296298,null,{"$f":"IFERROR(VLOOKUP($D203,prezence!A:F,2,0),\"\")","v":""},{"$f":"IFERROR(VLOOKUP($D203,prezence!A:F,3,0),\"\")","v":""},{"$f":"IFERROR(VLOOKUP($D203,prezence!A:F,4,0),\"\")","v":""},{"$f":"IFERROR(VLOOKUP($D203,prezence!A:F,5,0),\"\")","v":""},{"$f":"IFERROR(VLOOKUP($D203,prezence!A:F,6,0),\"\")","v":""}]
[199,null,-0.011921296296296298,null,{"$f":"IFERROR(VLOOKUP($D204,prezence!A:F,2,0),\"\")","v":""},{"$f":"IFERROR(VLOOKUP($D204,prezence!A:F,3,0),\"\")","v":""},{"$f":"IFERROR(VLOOKUP($D204,prezence!A:F,4,0),\"\")","v":""},{"$f":"IFERROR(VLOOKUP($D204,prezence!A:F,5,0),\"\")","v":""},{"$f":"IFERROR(VLOOKUP($D204,prezence!A:F,6,0),\"\")","v":""}]
[200,null,-0.011921296296296298,null,{"$f":"IFERROR(VLOOKUP($D205,prezence!A:F,2,0),\"\")","v":""},{"$f":"IFERROR(VLOOKUP($D205,prezence!A:F,3,0),\"\")","v":""},{"$f":"IFERROR(VLOOKUP($D205,prezence!A:F,4,0),\"\")","v":""},{"$f":"IFERROR(VLOOKUP($D205,prezence!A:F,5,0),\"\")","v":""},{"$f":"IFERROR(VLOOKUP($D205,prezence!A:F,6,0),\"\")","v":""}]

{"sheet":"prezence","index":1,"n_rows":44,"n_cols":12,"rows_kept":44}
["st.č.","Příjmení","Jméno","r.n.","Klub","Kategorie",null,"Startovní číslo","Jméno","Příjmení","Pohlaví","Přezdívka"]
[1,"Müller","Josef",1974,"PEPINO",{"$nulls":3},"Samuel","Pásztor","muž",2014]
[2,"Peštová","Jana",1980,"TÉRA",{"$nulls":3},"Antonín","Šedivý","muž",2020]
[3,"Rohlová","Jitka",1981,"Jitka",{"$nulls":3},"Petr","Kulíšek","muž",2013]
[4,"Sejvalová","Petra",1978,"Peťuška",{"$nulls":3},"Jaroslav","Sedláček","muž",2021]
[5,"Gavelčík","Tomáš",1985,"Tomáš",{"$nulls":3},"Matyáš","Trubač","muž",2013]
[6,"Riedl","Lukas",1983,"PEKY",{"$nulls":3},"Tomáš","Trubač","muž",2011]
[7,"Horská","Kateřina",1991,"Khaty",{"$nulls":3},"Marek","Vaja","muž",2009]
[8,"Deverová","Lenka",1992,"Deverka",{"$nulls":3},"Vojtěch","Odvárka","muž",2014]
[9,"Macháčková","Michaela",1980,"Michaela",{"$nulls":3},"Tomáš","Formánek","muž",2014]
[10,"Reiner","Lukáš",1980,"Lukáš",{"$nulls":3},"Jan","Formánek","muž",2011]
[11,"Rousova","Julie",1999,"Julie",{"$nulls":3},"Anežka","Formánková","žena",2016]
[12,"Rousova","Lucie",2002,"Lucie",{"$nulls":3},"Jiřina","Formánková","žena",2013]
[13,"Burianová","Denisa",1993,"Denda",{"$nulls":3},"Ondřej","Světlý","muž",2020]
[14,"Karasová","Anna",1984,"Anna",{"$nulls":3},"Tina","Riedlová","žena",2014]
[15,"Karas","Václav",1980,"Václav",{"$nulls":3},"Daniel","Křivan","muž",2017]
[16,"Sainerova","Kamila",1986,"Kamila",{"$nulls":3},"Vojtěch","Devera","muž",2015]
[17,"Sainer","Jiri",1983,"Sainy",{"$nulls":3},"Martin","Kunz","muž",2008]
[18,"Sejval","Jan",1979,"Jan",{"$nulls":3},"Marek","Kudry","muž",2013]
[19,"Sejvalová","Veronika",1986,"Veronika",{"$nulls":3},"Nikol","Kudryová","žena",2012]
[20,"Huja","Vitezslav",1987,"Vitezslav",{"$nulls":3},"Filip","Vejlupek","muž",2017]
[21,"Urbanová","Jaroslava",1964,"Jaroslava",{"$nulls":3},"Jiri","Sainer","muž",2011]
[22,"Vitovský","Petr",1964,"Cukrar",{"$nulls":3},"Šimon","Sainer","muž",2016]
[23,"Lukšík","Václav",1977,"Čáryfuk",{"$nulls":3},"Valerie","Sejvalová","žena",2019]
[null,"Horna","Tereza",1995,"Tereza",{"$nulls":3},"Michal","Veihand","muž",2013]
[25,"Kusá","Lenka",1973,"kusička",{"$nulls":3},"Jiří","Zach","muž",2009]
[26,"Kusý","Jan",1974,"kusič",{"$nulls":3},"Metoděj","Rohla","muž",2012]
[27,"Gaube","Jitka",1983,"Jíťa"]
[28,"RŮŽIČKA","PAVEL",1964,"PAVEL"]
[null,"Gabrielová","Lucie",1977,"Lucie"]
[30,"Charvátová","Michaela",1991,"Michaela"]
[31,"Klánová","Michaela",1991,"Michaela"]
[32,"Oulická","Jana",1984,"Jana"]
[33,"Petrmichl","Vít",1987,"Vít"]
[34,"Odvárka","Lukáš",1985,"Lukáš"]
[35,"Světlý","Ondřej",1979,"Ondřej"]
[36,"Pfeiferová","Veronika",1992,"Veronika"]
[37,"Kosina","Jakub",1990,"Jakub"]
[38,"Jirmus","Michal",1992,"Michal"]
[39,"Pásztor","Michal",1981,"Michal"]
[40,"Doležalová","Michaela",1980,"Michaela"]
[41,"Sedláčková","Petra",1993,"Petra"]
[42,"Vajová","Klára",2003,"Klára"]
[43,"Honka","Adela",1994,"Adela"]

{"sheet":"počet kol","index":2,"n_rows":11,"n_cols":8,"rows_kept":11}
["St. č.","Příjmení","Jméno","Nar.","Klub","Kategorie","uběhnuto","zbývá"]
[1,{"$f":"IFERROR(VLOOKUP($A2,prezence!A:F,2,0),\"\")","v":"Müller"},{"$f":"IFERROR(VLOOKUP($A2,prezence!A:F,3,0),\"\")","v":"Josef"},{"$f":"IFERROR(VLOOKUP($A2,prezence!A:F,4,0),\"\")","v":1974},{"$f":"IFERROR(VLOOKUP($A2,prezence!A:F,5,0),\"\")","v":"PEPINO"},{"$f":"IFERROR(VLOOKUP($A2,prezence!A:F,6,0),\"\")","v":0},{"$f":"COUNTIF(výsledky!D6:D3000,A2)","v":1},{"$f":"43-G2","v":42}]
[2,{"$f":"IFERROR(VLOOKUP($A3,prezence!A:F,2,0),\"\")","v":"Peštová"},{"$f":"IFERROR(VLOOKUP($A3,prezence!A:F,3,0),\"\")","v":"Jana"},{"$f":"IFERROR(VLOOKUP($A3,prezence!A:F,4,0),\"\")","v":1980},{"$f":"IFERROR(VLOOKUP($A3,prezence!A:F,5,0),\"\")","v":"TÉRA"},{"$f":"IFERROR(VLOOKUP($A3,prezence!A:F,6,0),\"\")","v":0},{"$f":"COUNTIF(výsledky!D7:D3001,A3)","v":1},{"$f":"43-G3","v":42}]
[3,{"$f":"IFERROR(VLOOKUP($A4,prezence!A:F,2,0),\"\")","v":"Rohlová"},{"$f":"IFERROR(VLOOKUP($A4,prezence!A:F,3,0),\"\")","v":"Jitka"},{"$f":"IFERROR(VLOOKUP($A4,prezence!A:F,4,0),\"\")","v":1981},{"$f":"IFERROR(VLOOKUP($A4,prezence!A:F,5,0),\"\")","v":"Jitka"},{"$f":"IFERROR(VLOOKUP($A4,prezence!A:F,6,0),\"\")","v":0},{"$f":"COUNTIF(výsledky!D8:D3002,A4)","v":0},43]
[4,{"$f":"IFERROR(VLOOKUP($A5,prezence!A:F,2,0),\"\")","v":"Sejvalová"},{"$f":"IFERROR(VLOOKUP($A5,prezence!A:F,3,0),\"\")","v":"Petra"},{"$f":"IFERROR(VLOOKUP($A5,prezence!A:F,4,0),\"\")","v":1978},{"$f":"IFERROR(VLOOKUP($A5,prezence!A:F,5,0),\"\")","v":"Peťuška"},{"$f":"IFERROR(VLOOKUP($A5,prezence!A:F,6,0),\"\")","v":0},{"$f":"COUNTIF(výsledky!D9:D3003,A5)","v":1},42]
[5,{"$f":"IFERROR(VLOOKUP($A6,prezence!A:F,2,0),\"\")","v":"Gavelčík"},{"$f":"IFERROR(VLOOKUP($A6,prezence!A:F,3,0),\"\")","v":"Tomáš"},{"$f":"IFERROR(VLOOKUP($A6,prezence!A:F,4,0),\"\")","v":1985},{"$f":"IFERROR(VLOOKUP($A6,prezence!A:F,5,0),\"\")","v":"Tomáš"},{"$f":"IFERROR(VLOOKUP($A6,prezence!A:F,6,0),\"\")","v":0},{"$f":"COUNTIF(výsledky!D10:D3004,A6)","v":1},42]
[6,{"$f":"IFERROR(VLOOKUP($A7,prezence!A:F,2,0),\"\")","v":"Riedl"},{"$f":"IFERROR(VLOOKUP($A7,prezence!A:F,3,0),\"\")","v":"Lukas"},{"$f":"IFERROR(VLOOKUP($A7,prezence!A:F,4,0),\"\")","v":1983},{"$f":"IFERROR(VLOOKUP($A7,prezence!A:F,5,0),\"\")","v":"PEKY"},{"$f":"IFERROR(VLOOKUP($A7,prezence!A:F,6,0),\"\")","v":0},{"$f":"COUNTIF(výsledky!D11:D3005,A7)","v":1},42]
[7,{"$f":"IFERROR(VLOOKUP($A8,prezence!A:F,2,0),\"\")","v":"Horská"},{"$f":"IFERROR(VLOOKUP($A8,prezence!A:F,3,0),\"\")","v":"Kateřina"},{"$f":"IFERROR(VLOOKUP($A8,prezence!A:F,4,0),\"\")","v":1991},{"$f":"IFERROR(VLOOKUP($A8,prezence!A:F,5,0),\"\")","v":"Khaty"},{"$f":"IFERROR(VLOOKUP($A8,prezence!A:F,6,0),\"\")","v":0},{"$f":"COUNTIF(výsledky!D12:D3006,A8)","v":1},42]
[{"$nulls":6},"1. okruh"]
[{"$nulls":6},"měří"]
[{"$nulls":6},"981,29 m"]

{"sheet":"LCD","index":3,"n_rows":201,"n_cols":7,"rows_kept":201}
["Poř.","Čas","Ztráta","St. č.","Příjmení","Jméno","Nar."]
[1,{"$f":"výsledky!B6","v":"00:17:10"},"-",{"$f":"výsledky!D6","v":20},{"$f":"IFERROR(VLOOKUP($D2,prezence!A:F,2,0),\"\")","v":"Huja"},{"$f":"IFERROR(VLOOKUP($D2,prezence!A:F,3,0),\"\")","v":"Vitezslav"},{"$f":"IFERROR(VLOOKUP($D2,prezence!A:F,4,0),\"\")","v":1987}]
[2,{"$f":"výsledky!B7","v":"00:17:32"},{"$f":"výsledky!C7","v":"00:00:22"},{"$f":"výsledky!D7","v":10},{"$f":"IFERROR(VLOOKUP($D3,prezence!A:F,2,0),\"\")","v":"Reiner"},{"$f":"IFERROR(VLOOKUP($D3,prezence!A:F,3,0),\"\")","v":"Lukáš"},{"$f":"IFERROR(VLOOKUP($D3,prezence!A:F,4,0),\"\")","v":1980}]
[3,{"$f":"výsledky!B8","v":"00:17:41"},{"$f":"výsledky!C8","v":"00:00:31"},{"$f":"výsledky!D8","v":14},{"$f":"IFERROR(VLOOKUP($D4,prezence!A:F,2,0),\"\")","v":"Karasová"},{"$f":"IFERROR(VLOOKUP($D4,prezence!A:F,3,0),\"\")","v":"Anna"},{"$f":"IFERROR(VLOOKUP($D4,prezence!A:F,4,0),\"\")","v":1984}]
[4,{"$f":"výsledky!B9","v":"00:18:56"},{"$f":"výsledky!C9","v":"00:01:46"},{"$f":"výsledky!D9","v":27},{"$f":"IFERROR(VLOOKUP($D5,prezence!A:F,2,0),\"\")","v":"Gaube"},{"$f":"IFERROR(VLOOKUP($D5,prezence!A:F,3,0),\"\")","v":"Jitka"},{"$f":"IFERROR(VLOOKUP($D5,prezence!A:F,4,0),\"\")","v":1983}]
[5,{"$f":"výsledky!B10","v":"00:19:23"},{"$f":"výsledky!C10","v":"00:02:13"},{"$f":"výsledky!D10","v":37},{"$f":"IFERROR(VLOOKUP($D6,prezence!A:F,2,0),\"\")","v":"Kosina"},{"$f":"IFERROR(VLOOKUP($D6,prezence!A:F,3,0),\"\")","v":"Jakub"},{"$f":"IFERROR(VLOOKUP($D6,prezence!A:F,4,0),\"\")","v":1990}]
[6,{"$f":"výsledky!B11","v":"00:19:35"},{"$f":"výsledky!C11","v":"00:02:25"},{"$f":"výsledky!D11","v":13},{"$f":"IFERROR(VLOOKUP($D7,prezence!A:F,2,0),\"\")","v":"Burianová"},{"$f":"IFERROR(VLOOKUP($D7,prezence!A:F,3,0),\"\")","v":"Denisa"},{"$f":"IFERROR(VLOOKUP($D7,prezence!A:F,4,0),\"\")","v":1993}]
[7,{"$f":"výsledky!B12","v":"00:20:07"},{"$f":"výsledky!C12","v":"00:02:57"},{"$f":"výsledky!D12","v":34},{"$f":"IFERROR(VLOOKUP($D8,prezence!A:F,2,0),\"\")","v":"Odvárka"},{"$f":"IFERROR(VLOOKUP($D8,prezence!A:F,3,0),\"\")","v":"Lukáš"},{"$f":"IFERROR(VLOOKUP($D8,prezence!A:F,4,0),\"\")","v":1985}]
[8,{"$f":"výsledky!B13","v":"00:20:21"},{"$f":"výsledky!C13","v":"00:03:11"},{"$f":"výsledky!D13","v":33},{"$f":"IFERROR(VLOOKUP($D9,prezence!A:F,2,0),\"\")","v":"Petrmichl"},{"$f":"IFERROR(VLOOKUP($D9,prezence!A:F,3,0),\"\")","v":"Vít"},{"$f":"IFERROR(VLOOKUP($D9,prezence!A:F,4,0),\"\")","v":1987}]
[9,{"$f":"výsledky!B14","v":"00:20:24"},{"$f":"výsledky!C14","v":"00:03:14"},{"$f":"výsledky!D14","v":39},{"$f":"IFERROR(VLOOKUP($D10,prezence!A:F,2,0),\"\")","v":"Pásztor"},{"$f":"IFERROR(VLOOKUP($D10,prezence!A:F,3,0),\"\")","v":"Michal"},{"$f":"IFERROR(VLOOKUP($D10,prezence!A:F,4,0),\"\")","v":1981}]
[10,{"$f":"výsledky!B15","v":"00:20:26"},{"$f":"výsledky!C15","v":"00:03:16"},{"$f":"výsledky!D15","v":15},{"$f":"IFERROR(VLOOKUP($D11,prezence!A:F,2,0),\"\")","v":"Karas"},{"$f":"IFERROR(VLOOKUP($D11,prezence!A:F,3,0),\"\")","v":"Václav"},{"$f":"IFERROR(VLOOKUP($D11,prezence!A:F,4,0),\"\")","v":1980}]
[11,{"$f":"výsledky!B16","v":"00:20:59"},{"$f":"výsledky!C16","v":"00:03:49"},{"$f":"výsledky!D16","v":17},{"$f":"IFERROR(VLOOKUP($D12,prezence!A:F,2,0),\"\")","v":"Sainer"},{"$f":"IFERROR(VLOOKUP($D12,prezence!A:F,3,0),\"\")","v":"Jiri"},{"$f":"IFERROR(VLOOKUP($D12,prezence!A:F,4,0),\"\")","v":1983}]
[12,{"$f":"výsledky!B17","v":"00:21:11"},{"$f":"výsledky!C17","v":"00:04:01"},{"$f":"výsledky!D17","v":6},{"$f":"IFERROR(VLOOKUP($D13,prezence!A:F,2,0),\"\")","v":"Riedl"},{"$f":"IFERROR(VLOOKUP($D13,prezence!A:F,3,0),\"\")","v":"Lukas"},{"$f":"IFERROR(VLOOKUP($D13,prezence!A:F,4,0),\"\")","v":1983}]
[13,{"$f":"výsledky!B18","v":"00:21:27"},{"$f":"výsledky!C18","v":"00:04:17"},{"$f":"výsledky!D18","v":26},{"$f":"IFERROR(VLOOKUP($D14,prezence!A:F,2,0),\"\")","v":"Kusý"},{"$f":"IFERROR(VLOOKUP($D14,prezence!A:F,3,0),\"\")","v":"Jan"},{"$f":"IFERROR(VLOOKUP($D14,prezence!A:F,4,0),\"\")","v":1974}]
[14,{"$f":"výsledky!B19","v":"00:21:31"},{"$f":"výsledky!C19","v":"00:04:21"},{"$f":"výsledky!D19","v":19},{"$f":"IFERROR(VLOOKUP($D15,prezence!A:F,2,0),\"\")","v":"Sejvalová"},{"$f":"IFERROR(VLOOKUP($D15,prezence!A:F,3,0),\"\")","v":"Veronika"},{"$f":"IFERROR(VLOOKUP($D15,prezence!A:F,4,0),\"\")","v":1986}]
[15,{"$f":"výsledky!B20","v":"00:21:37"},{"$f":"výsledky!C20","v":"00:04:27"},{"$f":"výsledky!D20","v":9},{"$f":"IFERROR(VLOOKUP($D16,prezence!A:F,2,0),\"\")","v":"Macháčková"},{"$f":"IFERROR(VLOOKUP($D16,prezence!A:F,3,0),\"\")","v":"Michaela"},{"$f":"IFERROR(VLOOKUP($D16,prezence!A:F,4,0),\"\")","v":1980}]
[16,{"$f":"výsledky!B21","v":"00:21:54"},{"$f":"výsledky!C21","v":"00:04:44"},{"$f":"výsledky!D21","v":1},{"$f":"IFERROR(VLOOKUP($D17,prezence!A:F,2,0),\"\")","v":"Müller"},{"$f":"IFERROR(VLOOKUP($D17,prezence!A:F,3,0),\"\")","v":"Josef"},{"$f":"IFERROR(VLOOKUP($D17,prezence!A:F,4,0),\"\")","v":1974}]
[17,{"$f":"výsledky!B22","v":"00:22:36"},{"$f":"výsledky!C22","v":"00:05:26"},{"$f":"výsledky!D22","v":7},{"$f":"IFERROR(VLOOKUP($D18,prezence!A:F,2,0),\"\")","v":"Horská"},{"$f":"IFERROR(VLOOKUP($D18,prezence!A:F,3,0),\"\")","v":"Kateřina"},{"$f":"IFERROR(VLOOKUP($D18,prezence!A:F,4,0),\"\")","v":1991}]
[18,{"$f":"výsledky!B23","v":"00:23:00"},{"$f":"výsledky!C23","v":"00:05:50"},{"$f":"výsledky!D23","v":8},{"$f":"IFERROR(VLOOKUP($D19,prezence!A:F,2,0),\"\")","v":"Deverová"},{"$f":"IFERROR(VLOOKUP($D19,prezence!A:F,3,0),\"\")","v":"Lenka"},{"$f":"IFERROR(VLOOKUP($D19,prezence!A:F,4,0),\"\")","v":1992}]
[19,{"$f":"výsledky!B24","v":"00:23:12"},{"$f":"výsledky!C24","v":"00:06:02"},{"$f":"výsledky!D24","v":31},{"$f":"IFERROR(VLOOKUP($D20,prezence!A:F,2,0),\"\")","v":"Klánová"},{"$f":"IFERROR(VLOOKUP($D20,prezence!A:F,3,0),\"\")","v":"Michaela"},{"$f":"IFERROR(VLOOKUP($D20,prezence!A:F,4,0),\"\")","v":1991}]
[20,{"$f":"výsledky!B25","v":"00:23:12"},{"$f":"výsledky!C25","v":"00:06:02"},{"$f":"výsledky!D25","v":35},{"$f":"IFERROR(VLOOKUP($D21,prezence!A:F,2,0),\"\")","v":"Světlý"},{"$f":"IFERROR(VLOOKUP($D21,prezence!A:F,3,0),\"\")","v":"Ondřej"},{"$f":"IFERROR(VLOOKUP($D21,prezence!A:F,4,0),\"\")","v":1979}]
[21,{"$f":"výsledky!B26","v":"00:23:49"},{"$f":"výsledky!C26","v":"00:06:39"},{"$f":"výsledky!D26","v":41},{"$f":"IFERROR(VLOOKUP($D22,prezence!A:F,2,0),\"\")","v":"Sedláčková"},{"$f":"IFERROR(VLOOKUP($D22,prezence!A:F,3,0),\"\")","v":"Petra"},{"$f":"IFERROR(VLOOKUP($D22,prezence!A:F,4,0),\"\")","v":1993}]
[22,{"$f":"výsledky!B27","v":"00:23:49"},{"$f":"výsledky!C27","v":"00:06:39"},{"$f":"výsledky!D27","v":43},{"$f":"IFERROR(VLOOKUP($D23,prezence!A:F,2,0),\"\")","v":"Honka"},{"$f":"IFERROR(VLOOKUP($D23,prezence!A:F,3,0),\"\")","v":"Adela"},{"$f":"IFERROR(VLOOKUP($D23,prezence!A:F,4,0),\"\")","v":1994}]
[23,{"$f":"výsledky!B28","v":"00:24:06"},{"$f":"výsledky!C28","v":"00:06:56"},{"$f":"výsledky!D28","v":30},{"$f":"IFERROR(VLOOKUP($D24,prezence!A:F,2,0),\"\")","v":"Charvátová"},{"$f":"IFERROR(VLOOKUP($D24,prezence!A:F,3,0),\"\")","v":"Michaela"},{"$f":"IFERROR(VLOOKUP($D24,prezence!A:F,4,0),\"\")","v":1991}]
[24,{"$f":"výsledky!B29","v":"00:24:10"},{"$f":"výsledky!C29","v":"00:07:00"},{"$f":"výsledky!D29","v":23},{"$f":"IFERROR(VLOOKUP($D25,prezence!A:F,2,0),\"\")","v":"Lukšík"},{"$f":"IFERROR(VLOOKUP($D25,prezence!A:F,3,0),\"\")","v":"Václav"},{"$f":"IFERROR(VLOOKUP($D25,prezence!A:F,4,0),\"\")","v":1977}]
[25,{"$f":"výsledky!B30","v":"00:24:16"},{"$f":"výsledky!C30","v":"00:07:06"},{"$f":"výsledky!D30","v":25},{"$f":"IFERROR(VLOOKUP($D26,prezence!A:F,2,0),\"\")","v":"Kusá"},{"$f":"IFERROR(VLOOKUP($D26,prezence!A:F,3,0),\"\")","v":"Lenka"},{"$f":"IFERROR(VLOOKUP($D26,prezence!A:F,4,0),\"\")","v":1973}]
[26,{"$f":"výsledky!B31","v":"00:24:31"},{"$f":"výsledky!C31","v":"00:07:21"},{"$f":"výsledky!D31","v":21},{"$f":"IFERROR(VLOOKUP($D27,prezence!A:F,2,0),\"\")","v":"Urbanová"},{"$f":"IFERROR(VLOOKUP($D27,prezence!A:F,3,0),\"\")","v":"Jaroslava"},{"$f":"IFERROR(VLOOKUP($D27,prezence!A:F,4,0),\"\")","v":1964}]
[27,{"$f":"výsledky!B32","v":"00:24:31"},{"$f":"výsledky!C32","v":"00:07:21"},{"$f":"výsledky!D32","v":22},{"$f":"IFERROR(VLOOKUP($D28,prezence!A:F,2,0),\"\")","v":"Vitovský"},{"$f":"IFERROR(VLOOKUP($D28,prezence!A:F,3,0),\"\")","v":"Petr"},{"$f":"IFERROR(VLOOKUP($D28,prezence!A:F,4,0),\"\")","v":1964}]
[28,{"$f":"výsledky!B33","v":"00:25:19"},{"$f":"výsledky!C33","v":"00:08:09"},{"$f":"výsledky!D33","v":38},{"$f":"IFERROR(VLOOKUP($D29,prezence!A:F,2,0),\"\")","v":"Jirmus"},{"$f":"IFERROR(VLOOKUP($D29,prezence!A:F,3,0),\"\")","v":"Michal"},{"$f":"IFERROR(VLOOKUP($D29,prezence!A:F,4,0),\"\")","v":1992}]
[29,{"$f":"výsledky!B34","v":"00:25:23"},{"$f":"výsledky!C34","v":"00:08:13"},{"$f":"výsledky!D34","v":28},{"$f":"IFERROR(VLOOKUP($D30,prezence!A:F,2,0),\"\")","v":"RŮŽIČKA"},{"$f":"IFERROR(VLOOKUP($D30,prezence!A:F,3,0),\"\")","v":"PAVEL"},{"$f":"IFERROR(VLOOKUP($D30,prezence!A:F,4,0),\"\")","v":1964}]
[30,{"$f":"výsledky!B35","v":"00:25:28"},{"$f":"výsledky!C35","v":"00:08:18"},{"$f":"výsledky!D35","v":5},{"$f":"IFERROR(VLOOKUP($D31,prezence!A:F,2,0),\"\")","v":"Gavelčík"},{"$f":"IFERROR(VLOOKUP($D31,prezence!A:F,3,0),\"\")","v":"Tomáš"},{"$f":"IFERROR(VLOOKUP($D31,prezence!A:F,4,0),\"\")","v":1985}]
[31,{"$f":"výsledky!B36","v":"00:26:54"},{"$f":"výsledky!C36","v":"00:09:44"},{"$f":"výsledky!D36","v":18},{"$f":"IFERROR(VLOOKUP($D32,prezence!A:F,2,0),\"\")","v":"Sejval"},{"$f":"IFERROR(VLOOKUP($D32,prezence!A:F,3,0),\"\")","v":"Jan"},{"$f":"IFERROR(VLOOKUP($D32,prezence!A:F,4,0),\"\")","v":1979}]
[32,{"$f":"výsledky!B37","v":"00:26:55"},{"$f":"výsledky!C37","v":"00:09:45"},{"$f":"výsledky!D37","v":40},{"$f":"IFERROR(VLOOKUP($D33,prezence!A:F,2,0),\"\")","v":"Doležalová"},{"$f":"IFERROR(VLOOKUP($D33,prezence!A:F,3,0),\"\")","v":"Michaela"},{"$f":"IFERROR(VLOOKUP($D33,prezence!A:F,4,0),\"\")","v":1980}]
[33,{"$f":"výsledky!B38","v":"00:28:15"},{"$f":"výsledky!C38","v":"00:11:05"},{"$f":"výsledky!D38","v":2},{"$f":"IFERROR(VLOOKUP($D34,prezence!A:F,2,0),\"\")","v":"Peštová"},{"$f":"IFERROR(VLOOKUP($D34,prezence!A:F,3,0),\"\")","v":"Jana"},{"$f":"IFERROR(VLOOKUP($D34,prezence!A:F,4,0),\"\")","v":1980}]
[34,{"$f":"výsledky!B39","v":"00:28:30"},{"$f":"výsledky!C39","v":"00:11:20"},{"$f":"výsledky!D39","v":12},{"$f":"IFERROR(VLOOKUP($D35,prezence!A:F,2,0),\"\")","v":"Rousova"},{"$f":"IFERROR(VLOOKUP($D35,prezence!A:F,3,0),\"\")","v":"Lucie"},{"$f":"IFERROR(VLOOKUP($D35,prezence!A:F,4,0),\"\")","v":2002}]
[35,{"$f":"výsledky!B40","v":"00:28:30"},{"$f":"výsledky!C40","v":"00:11:20"},{"$f":"výsledky!D40","v":11},{"$f":"IFERROR(VLOOKUP($D36,prezence!A:F,2,0),\"\")","v":"Rousova"},{"$f":"IFERROR(VLOOKUP($D36,prezence!A:F,3,0),\"\")","v":"Julie"},{"$f":"IFERROR(VLOOKUP($D36,prezence!A:F,4,0),\"\")","v":1999}]
[36,{"$f":"výsledky!B41","v":"00:29:59"},{"$f":"výsledky!C41","v":"00:12:49"},{"$f":"výsledky!D41","v":36},{"$f":"IFERROR(VLOOKUP($D37,prezence!A:F,2,0),\"\")","v":"Pfeiferová"},{"$f":"IFERROR(VLOOKUP($D37,prezence!A:F,3,0),\"\")","v":"Veronika"},{"$f":"IFERROR(VLOOKUP($D37,prezence!A:F,4,0),\"\")","v":1992}]
[37,{"$f":"výsledky!B42","v":"00:31:46"},{"$f":"výsledky!C42","v":"00:14:36"},{"$f":"výsledky!D42","v":4},{"$f":"IFERROR(VLOOKUP($D38,prezence!A:F,2,0),\"\")","v":"Sejvalová"},{"$f":"IFERROR(VLOOKUP($D38,prezence!A:F,3,0),\"\")","v":"Petra"},{"$f":"IFERROR(VLOOKUP($D38,prezence!A:F,4,0),\"\")","v":1978}]
[38,{"$f":"výsledky!B43","v":"00:34:55"},{"$f":"výsledky!C43","v":"00:17:45"},42,{"$f":"IFERROR(VLOOKUP($D39,prezence!A:F,2,0),\"\")","v":"Vajová"},{"$f":"IFERROR(VLOOKUP($D39,prezence!A:F,3,0),\"\")","v":"Klára"},{"$f":"IFERROR(VLOOKUP($D39,prezence!A:F,4,0),\"\")","v":2003}]
[39,{"$f":"výsledky!B44","v":"00:00:00"},{"$f":"výsledky!C44","v":-0.011921296296296298},{"$f":"výsledky!D44","v":0},{"$f":"IFERROR(VLOOKUP($D40,prezence!A:F,2,0),\"\")","v":""},{"$f":"IFERROR(VLOOKUP($D40,prezence!A:F,3,0),\"\")","v":""},{"$f":"IFERROR(VLOOKUP($D40,prezence!A:F,4,0),\"\")","v":""}]
[40,{"$f":"výsledky!B45","v":"00:00:00"},{"$f":"výsledky!C45","v":-0.011921296296296298},{"$f":"výsledky!D45","v":0},{"$f":"IFERROR(VLOOKUP($D41,prezence!A:F,2,0),\"\")","v":""},{"$f":"IFERROR(VLOOKUP($D41,prezence!A:F,3,0),\"\")","v":""},{"$f":"IFERROR(VLOOKUP($D41,prezence!A:F,4,0),\"\")","v":""}]
[41,{"$f":"výsledky!B46","v":"00:00:00"},{"$f":"výsledky!C46","v":-0.011921296296296298},{"$f":"výsledky!D46","v":0},{"$f":"IFERROR(VLOOKUP($D42,prezence!A:F,2,0),\"\")","v":""},{"$f":"IFERROR(VLOOKUP($D42,prezence!A:F,3,0),\"\")","v":""},{"$f":"IFERROR(VLOOKUP($D42,prezence!A:F,4,0),\"\")","v":""}]
[42,{"$f":"výsledky!B47","v":"00:00:00"},{"$f":"výsledky!C47","v":-0.011921296296296298},{"$f":"výsledky!D47","v":0},{"$f":"IFERROR(VLOOKUP($D43,prezence!A:F,2,0),\"\")","v":""},{"$f":"IFERROR(VLOOKUP($D43,prezence!A:F,3,0),\"\")","v":""},{"$f":"IFERROR(VLOOKUP($D43,prezence!A:F,4,0),\"\")","v":""}]
[43,{"$f":"výsledky!B48","v":"00:00:00"},{"$f":"výsledky!C48","v":-0.011921296296296298},{"$f":"výsledky!D48","v":0},{"$f":"IFERROR(VLOOKUP($D44,prezence!A:F,2,0),\"\")","v":""},{"$f":"IFERROR(VLOOKUP($D44,prezence!A:F,3,0),\"\")","v":""},{"$f":"IFERROR(VLOOKUP($D44,prezence!A:F,4,0),\"\")","v":""}]
[44,{"$f":"výsledky!B49","v":"00:00:00"},{"$f":"výsledky!C49","v":-0.011921296296296298},{"$f":"výsledky!D49","v":0},{"$f":"IFERROR(VLOOKUP($D45,prezence!A:F,2,0),\"\")","v":""},{"$f":"IFERROR(VLOOKUP($D45,prezence!A:F,3,0),\"\")","v":""},{"$f":"IFERROR(VLOOKUP($D45,prezence!A:F,4,0),\"\")","v":""}]
[45,{"$f":"výsledky!B50","v":"00:00:00"},{"$f":"výsledky!C50","v":-0.011921296296296298},{"$f":"výsledky!D50","v":0},{"$f":"IFERROR(VLOOKUP($D46,prezence!A:F,2,0),\"\")","v":""},{"$f":"IFERROR(VLOOKUP($D46,prezence!A:F,3,0),\"\")","v":""},{"$f":"IFERROR(VLOOKUP($D46,prezence!A:F,4,0),\"\")","v":""}]
[46,{"$f":"výsledky!B51","v":"00:00:00"},{"$f":"výsledky!C51","v":-0.011921296296296298},{"$f":"výsledky!D51","v":0},{"$f":"IFERROR(VLOOKUP($D47,prezence!A:F,2,0),\"\")","v":""},{"$f":"IFERROR(VLOOKUP($D47,prezence!A:F,3,0),\"\")","v":""},{"$f":"IFERROR(VLOOKUP($D47,prezence!A:F,4,0),\"\")","v":""}]
[47,{"$f":"výsledky!B52","v":"00:00:00"},{"$f":"výsledky!C52","v":-0.011921296296296298},{"$f":"výsledky!D52","v":0},{"$f":"IFERROR(VLOOKUP($D48,prezence!A:F,2,0),\"\")","v":""},{"$f":"IFERROR(VLOOKUP($D48,prezence!A:F,3,0),\"\")","v":""},{"$f":"IFERROR(VLOOKUP($D48,prezence!A:F,4,0),\"\")","v":""}]
[48,{"$f":"výsledky!B53","v":"00:00:00"},{"$f":"výsledky!C53","v":-0.011921296296296298},{"$f":"výsledky!D53","v":0},{"$f":"IFERROR(VLOOKUP($D49,prezence!A:F,2,0),\"\")","v":""},{"$f":"IFERROR(VLOOKUP($D49,prezence!A:F,3,0),\"\")","v":""},{"$f":"IFERROR(VLOOKUP($D49,prezence!A:F,4,0),\"\")","v":""}]
[49,{"$f":"výsledky!B54","v":"00:00:00"},{"$f":"výsledky!C54","v":-0.011921296296296298},{"$f":"výsledky!D54","v":0},{"$f":"IFERROR(VLOOKUP($D50,prezence!A:F,2,0),\"\")","v":""},{"$f":"IFERROR(VLOOKUP($D50,prezence!A:F,3,0),\"\")","v":""},{"$f":"IFERROR(VLOOKUP($D50,prezence!A:F,4,0),\"\")","v":""}]
[50,{"$f":"výsledky!B55","v":"00:00:00"},{"$f":"výsledky!C55","v":-0.011921296296296298},{"$f":"výsledky!D55","v":0},{"$f":"IFERROR(VLOOKUP($D51,prezence!A:F,2,0),\"\")","v":""},{"$f":"IFERROR(VLOOKUP($D51,prezence!A:F,3,0),\"\")","v":""},{"$f":"IFERROR(VLOOKUP($D51,prezence!A:F,4,0),\"\")","v":""}]
[51,{"$f":"výsledky!B56","v":"00:00:00"},{"$f":"výsledky!C56","v":-0.011921296296296298},{"$f":"výsledky!D56","v":0},{"$f":"IFERROR(VLOOKUP($D52,prezence!A:F,2,0),\"\")","v":""},{"$f":"IFERROR(VLOOKUP($D52,prezence!A:F,3,0),\"\")","v":""},{"$f":"IFERROR(VLOOKUP($D52,prezence!A:F,4,0),\"\")","v":""}]
[52,{"$f":"výsledky!B57","v":"00:00:00"},{"$f":"výsledky!C57","v":-0.011921296296296298},{"$f":"výsledky!D57","v":0},{"$f":"IFERROR(VLOOKUP($D53,prezence!A:F,2,0),\"\")","v":""},{"$f":"IFERROR(VLOOKUP($D53,prezence!A:F,3,0),\"\")","v":""},{"$f":"IFERROR(VLOOKUP($D53,prezence!A:F,4,0),\"\")","v":""}]
[53,{"$f":"výsledky!B58","v":"00:00:00"},{"$f":"výsledky!C58","v":-0.011921296296296298},{"$f":"výsledky!D58","v":0},{"$f":"IFERROR(VLOOKUP($D54,prezence!A:F,2,0),\"\")","v":""},{"$f":"IFERROR(VLOOKUP($D54,prezence!A:F,3,0),\"\")","v":""},{"$f":"IFERROR(VLOOKUP($D54,prezence!A:F,4,0),\"\")","v":""}]
[54,{"$f":"výsledky!B59","v":"00:00:00"},{"$f":"výsledky!C59","v":-0.011921296296296298},{"$f":"výsledky!D59","v":0},{"$f":"IFERROR(VLOOKUP($D55,prezence!A:F,2,0),\"\")","v":""},{"$f":"IFERROR(VLOOKUP($D55,prezence!A:F,3,0),\"\")","v":""},{"$f":"IFERROR(VLOOKUP($D55,prezence!A:F,4,0),\"\")","v":""}]
[55,{"$f":"výsledky!B60","v":"00:00:00"},{"$f":"výsledky!C60","v":-0.011921296296296298},{"$f":"výsledky!D60","v":0},{"$f":"IFERROR(VLOOKUP($D56,prezence!A:F,2,0),\"\")","v":""},{"$f":"IFERROR(VLOOKUP($D56,prezence!A:F,3,0),\"\")","v":""},{"$f":"IFERROR(VLOOKUP($D56,prezence!A:F,4,0),\"\")","v":""}]
[56,{"$f":"výsledky!B61","v":"00:00:00"},{"$f":"výsledky!C61","v":-0.011921296296296298},{"$f":"výsledky!D61","v":0},{"$f":"IFERROR(VLOOKUP($D57,prezence!A:F,2,0),\"\")","v":""},{"$f":"IFERROR(VLOOKUP($D57,prezence!A:F,3,0),\"\")","v":""},{"$f":"IFERROR(VLOOKUP($D57,prezence!A:F,4,0),\"\")","v":""}]
[57,{"$f":"výsledky!B62","v":"00:00:00"},{"$f":"výsledky!C62","v":-0.011921296296296298},{"$f":"výsledky!D62","v":0},{"$f":"IFERROR(VLOOKUP($D58,prezence!A:F,2,0),\"\")","v":""},{"$f":"IFERROR(VLOOKUP($D58,prezence!A:F,3,0),\"\")","v":""},{"$f":"IFERROR(VLOOKUP($D58,prezence!A:F,4,0),\"\")","v":""}]
[58,{"$f":"výsledky!B63","v":"00:00:00"},{"$f":"výsledky!C63","v":-0.011921296296296298},{"$f":"výsledky!D63","v":0},{"$f":"IFERROR(VLOOKUP($D59,prezence!A:F,2,0),\"\")","v":""},{"$f":"IFERROR(VLOOKUP($D59,prezence!A:F,3,0),\"\")","v":""},{"$f":"IFERROR(VLOOKUP($D59,prezence!A:F,4,0),\"\")","v":""}]
[59,{"$f":"výsledky!B64","v":"00:00:00"},{"$f":"výsledky!C64","v":-0.011921296296296298},{"$f":"výsledky!D64","v":0},{"$f":"IFERROR(VLOOKUP($D60,prezence!A:F,2,0),\"\")","v":""},{"$f":"IFERROR(VLOOKUP($D60,prezence!A:F,3,0),\"\")","v":""},{"$f":"IFERROR(VLOOKUP($D60,prezence!A:F,4,0),\"\")","v":""}]
[60,{"$f":"výsledky!B65","v":"00:00:00"},{"$f":"výsledky!C65","v":-0.011921296296296298},{"$f":"výsledky!D65","v":0},{"$f":"IFERROR(VLOOKUP($D61,prezence!A:F,2,0),\"\")","v":""},{"$f":"IFERROR(VLOOKUP($D61,prezence!A:F,3,0),\"\")","v":""},{"$f":"IFERROR(VLOOKUP($D61,prezence!A:F,4,0),\"\")","v":""}]
[61,{"$f":"výsledky!B66","v":"00:00:00"},{"$f":"výsledky!C66","v":-0.011921296296296298},{"$f":"výsledky!D66","v":0},{"$f":"IFERROR(VLOOKUP($D62,prezence!A:F,2,0),\"\")","v":""},{"$f":"IFERROR(VLOOKUP($D62,prezence!A:F,3,0),\"\")","v":""},{"$f":"IFERROR(VLOOKUP($D62,prezence!A:F,4,0),\"\")","v":""}]
[62,{"$f":"výsledky!B67","v":"00:00:00"},{"$f":"výsledky!C67","v":-0.011921296296296298},{"$f":"výsledky!D67","v":0},{"$f":"IFERROR(VLOOKUP($D63,prezence!A:F,2,0),\"\")","v":""},{"$f":"IFERROR(VLOOKUP($D63,prezence!A:F,3,0),\"\")","v":""},{"$f":"IFERROR(VLOOKUP($D63,prezence!A:F,4,0),\"\")","v":""}]
[63,{"$f":"výsledky!B68","v":"00:00:00"},{"$f":"výsledky!C68","v":-0.011921296296296298},{"$f":"výsledky!D68","v":0},{"$f":"IFERROR(VLOOKUP($D64,prezence!A:F,2,0),\"\")","v":""},{"$f":"IFERROR(VLOOKUP($D64,prezence!A:F,3,0),\"\")","v":""},{"$f":"IFERROR(VLOOKUP($D64,prezence!A:F,4,0),\"\")","v":""}]
[64,{"$f":"výsledky!B69","v":"00:00:00"},{"$f":"výsledky!C69","v":-0.011921296296296298},{"$f":"výsledky!D69","v":0},{"$f":"IFERROR(VLOOKUP($D65,prezence!A:F,2,0),\"\")","v":""},{"$f":"IFERROR(VLOOKUP($D65,prezence!A:F,3,0),\"\")","v":""},{"$f":"IFERROR(VLOOKUP($D65,prezence!A:F,4,0),\"\")","v":""}]
[65,{"$f":"výsledky!B70","v":"00:00:00"},{"$f":"výsledky!C70","v":-0.011921296296296298},{"$f":"výsledky!D70","v":0},{"$f":"IFERROR(VLOOKUP($D66,prezence!A:F,2,0),\"\")","v":""},{"$f":"IFERROR(VLOOKUP($D66,prezence!A:F,3,0),\"\")","v":""},{"$f":"IFERROR(VLOOKUP($D66,prezence!A:F,4,0),\"\")","v":""}]
[66,{"$f":"výsledky!B71","v":"00:00:00"},{"$f":"výsledky!C71","v":-0.011921296296296298},{"$f":"výsledky!D71","v":0},{"$f":"IFERROR(VLOOKUP($D67,prezence!A:F,2,0),\"\")","v":""},{"$f":"IFERROR(VLOOKUP($D67,prezence!A:F,3,0),\"\")","v":""},{"$f":"IFERROR(VLOOKUP($D67,prezence!A:F,4,0),\"\")","v":""}]
[67,{"$f":"výsledky!B72","v":"00:00:00"},{"$f":"výsledky!C72","v":-0.011921296296296298},{"$f":"výsledky!D72","v":0},{"$f":"IFERROR(VLOOKUP($D68,prezence!A:F,2,0),\"\")","v":""},{"$f":"IFERROR(VLOOKUP($D68,prezence!A:F,3,0),\"\")","v":""},{"$f":"IFERROR(VLOOKUP($D68,prezence!A:F,4,0),\"\")","v":""}]
[68,{"$f":"výsledky!B73","v":"00:00:00"},{"$f":"výsledky!C73","v":-0.011921296296296298},{"$f":"výsledky!D73","v":0},{"$f":"IFERROR(VLOOKUP($D69,prezence!A:F,2,0),\"\")","v":""},{"$f":"IFERROR(VLOOKUP($D69,prezence!A:F,3,0),\"\")","v":""},{"$f":"IFERROR(VLOOKUP($D69,prezence!A:F,4,0),\"\")","v":""}]
[69,{"$f":"výsledky!B74","v":"00:00:00"},{"$f":"výsledky!C74","v":-0.011921296296296298},{"$f":"výsledky!D74","v":0},{"$f":"IFERROR(VLOOKUP($D70,prezence!A:F,2,0),\"\")","v":""},{"$f":"IFERROR(VLOOKUP($D70,prezence!A:F,3,0),\"\")","v":""},{"$f":"IFERROR(VLOOKUP($D70,prezence!A:F,4,0),\"\")","v":""}]
[70,{"$f":"výsledky!B75","v":"00:00:00"},{"$f":"výsledky!C75","v":-0.011921296296296298},{"$f":"výsledky!D75","v":0},{"$f":"IFERROR(VLOOKUP($D71,prezence!A:F,2,0),\"\")","v":""},{"$f":"IFERROR(VLOOKUP($D71,prezence!A:F,3,0),\"\")","v":""},{"$f":"IFERROR(VLOOKUP($D71,prezence!A:F,4,0),\"\")","v":""}]
[71,{"$f":"výsledky!B76","v":"00:00:00"},{"$f":"výsledky!C76","v":-0.011921296296296298},{"$f":"výsledky!D76","v":0},{"$f":"IFERROR(VLOOKUP($D72,prezence!A:F,2,0),\"\")","v":""},{"$f":"IFERROR(VLOOKUP($D72,prezence!A:F,3,0),\"\")","v":""},{"$f":"IFERROR(VLOOKUP($D72,prezence!A:F,4,0),\"\")","v":""}]
[72,{"$f":"výsledky!B77","v":"00:00:00"},{"$f":"výsledky!C77","v":-0.011921296296296298},{"$f":"výsledky!D77","v":0},{"$f":"IFERROR(VLOOKUP($D73,prezence!A:F,2,0),\"\")","v":""},{"$f":"IFERROR(VLOOKUP($D73,prezence!A:F,3,0),\"\")","v":""},{"$f":"IFERROR(VLOOKUP($D73,prezence!A:F,4,0),\"\")","v":""}]
[73,{"$f":"výsledky!B78","v":"00:00:00"},{"$f":"výsledky!C78","v":-0.011921296296296298},{"$f":"výsledky!D78","v":0},{"$f":"IFERROR(VLOOKUP($D74,prezence!A:F,2,0),\"\")","v":""},{"$f":"IFERROR(VLOOKUP($D74,prezence!A:F,3,0),\"\")","v":""},{"$f":"IFERROR(VLOOKUP($D74,prezence!A:F,4,0),\"\")","v":""}]
[74,{"$f":"výsledky!B79","v":"00:00:00"},{"$f":"výsledky!C79","v":-0.011921296296296298},{"$f":"výsledky!D79","v":0},{"$f":"IFERROR(VLOOKUP($D75,prezence!A:F,2,0),\"\")","v":""},{"$f":"IFERROR(VLOOKUP($D75,prezence!A:F,3,0),\"\")","v":""},{"$f":"IFERROR(VLOOKUP($D75,prezence!A:F,4,0),\"\")","v":""}]
[75,{"$f":"výsledky!B80","v":"00:00:00"},{"$f":"výsledky!C80","v":-0.011921296296296298},{"$f":"výsledky!D80","v":0},{"$f":"IFERROR(VLOOKUP($D76,prezence!A:F,2,0),\"\")","v":""},{"$f":"IFERROR(VLOOKUP($D76,prezence!A:F,3,0),\"\")","v":""},{"$f":"IFERROR(VLOOKUP($D76,prezence!A:F,4,0),\"\")","v":""}]
[76,{"$f":"výsledky!B81","v":"00:00:00"},{"$f":"výsledky!C81","v":-0.011921296296296298},{"$f":"výsledky!D81","v":0},{"$f":"IFERROR(VLOOKUP($D77,prezence!A:F,2,0),\"\")","v":""},{"$f":"IFERROR(VLOOKUP($D77,prezence!A:F,3,0),\"\")","v":""},{"$f":"IFERROR(VLOOKUP($D77,prezence!A:F,4,0),\"\")","v":""}]
[77,{"$f":"výsledky!B82","v":"00:00:00"},{"$f":"výsledky!C82","v":-0.011921296296296298},{"$f":"výsledky!D82","v":0},{"$f":"IFERROR(VLOOKUP($D78,prezence!A:F,2,0),\"\")","v":""},{"$f":"IFERROR(VLOOKUP($D78,prezence!A:F,3,0),\"\")","v":""},{"$f":"IFERROR(VLOOKUP($D78,prezence!A:F,4,0),\"\")","v":""}]
[78,{"$f":"výsledky!B83","v":"00:00:00"},{"$f":"výsledky!C83","v":-0.011921296296296298},{"$f":"výsledky!D83","v":0},{"$f":"IFERROR(VLOOKUP($D79,prezence!A:F,2,0),\"\")","v":""},{"$f":"IFERROR(VLOOKUP($D79,prezence!A:F,3,0),\"\")","v":""},{"$f":"IFERROR(VLOOKUP($D79,prezence!A:F,4,0),\"\")","v":""}]
[79,{"$f":"výsledky!B84","v":"00:00:00"},{"$f":"výsledky!C84","v":-0.011921296296296298},{"$f":"výsledky!D84","v":0},{"$f":"IFERROR(VLOOKUP($D80,prezence!A:F,2,0),\"\")","v":""},{"$f":"IFERROR(VLOOKUP($D80,prezence!A:F,3,0),\"\")","v":""},{"$f":"IFERROR(VLOOKUP($D80,prezence!A:F,4,0),\"\")","v":""}]
[80,{"$f":"výsledky!B85","v":"00:00:00"},{"$f":"výsledky!C85","v":-0.011921296296296298},{"$f":"výsledky!D85","v":0},{"$f":"IFERROR(VLOOKUP($D81,prezence!A:F,2,0),\"\")","v":""},{"$f":"IFERROR(VLOOKUP($D81,prezence!A:F,3,0),\"\")","v":""},{"$f":"IFERROR(VLOOKUP($D81,prezence!A:F,4,0),\"\")","v":""}]
[81,{"$f":"výsledky!B86","v":"00:00:00"},{"$f":"výsledky!C86","v":-0.011921296296296298},{"$f":"výsledky!D86","v":0},{"$f":"IFERROR(VLOOKUP($D82,prezence!A:F,2,0),\"\")","v":""},{"$f":"IFERROR(VLOOKUP($D82,prezence!A:F,3,0),\"\")","v":""},{"$f":"IFERROR(VLOOKUP($D82,prezence!A:F,4,0),\"\")","v":""}]
[82,{"$f":"výsledky!B87","v":"00:00:00"},{"$f":"výsledky!C87","v":-0.011921296296296298},{"$f":"výsledky!D87","v":0},{"$f":"IFERROR(VLOOKUP($D83,prezence!A:F,2,0),\"\")","v":""},{"$f":"IFERROR(VLOOKUP($D83,prezence!A:F,3,0),\"\")","v":""},{"$f":"IFERROR(VLOOKUP($D83,prezence!A:F,4,0),\"\")","v":""}]
[83,{"$f":"výsledky!B88","v":"00:00:00"},{"$f":"výsledky!C88","v":-0.011921296296296298},{"$f":"výsledky!D88","v":0},{"$f":"IFERROR(VLOOKUP($D84,prezence!A:F,2,0),\"\")","v":""},{"$f":"IFERROR(VLOOKUP($D84,prezence!A:F,3,0),\"\")","v":""},{"$f":"IFERROR(VLOOKUP($D84,prezence!A:F,4,0),\"\")","v":""}]
[84,{"$f":"výsledky!B89","v":"00:00:00"},{"$f":"výsledky!C89","v":-0.011921296296296298},{"$f":"výsledky!D89","v":0},{"$f":"IFERROR(VLOOKUP($D85,prezence!A:F,2,0),\"\")","v":""},{"$f":"IFERROR(VLOOKUP($D85,prezence!A:F,3,0),\"\")","v":""},{"$f":"IFERROR(VLOOKUP($D85,prezence!A:F,4,0),\"\")","v":""}]
[85,{"$f":"výsledky!B90","v":"00:00:00"},{"$f":"výsledky!C90","v":-0.011921296296296298},{"$f":"výsledky!D90","v":0},{"$f":"IFERROR(VLOOKUP($D86,prezence!A:F,2,0),\"\")","v":""},{"$f":"IFERROR(VLOOKUP($D86,prezence!A:F,3,0),\"\")","v":""},{"$f":"IFERROR(VLOOKUP($D86,prezence!A:F,4,0),\"\")","v":""}]
[86,{"$f":"výsledky!B91","v":"00:00:00"},{"$f":"výsledky!C91","v":-0.011921296296296298},{"$f":"výsledky!D91","v":0},{"$f":"IFERROR(VLOOKUP($D87,prezence!A:F,2,0),\"\")","v":""},{"$f":"IFERROR(VLOOKUP($D87,prezence!A:F,3,0),\"\")","v":""},{"$f":"IFERROR(VLOOKUP($D87,prezence!A:F,4,0),\"\")","v":""}]
[87,{"$f":"výsledky!B92","v":"00:00:00"},{"$f":"výsledky!C92","v":-0.011921296296296298},{"$f":"výsledky!D92","v":0},{"$f":"IFERROR(VLOOKUP($D88,prezence!A:F,2,0),\"\")","v":""},{"$f":"IFERROR(VLOOKUP($D88,prezence!A:F,3,0),\"\")","v":""},{"$f":"IFERROR(VLOOKUP($D88,prezence!A:F,4,0),\"\")","v":""}]
[88,{"$f":"výsledky!B93","v":"00:00:00"},{"$f":"výsledky!C93","v":-0.011921296296296298},{"$f":"výsledky!D93","v":0},{"$f":"IFERROR(VLOOKUP($D89,prezence!A:F,2,0),\"\")","v":""},{"$f":"IFERROR(VLOOKUP($D89,prezence!A:F,3,0),\"\")","v":""},{"$f":"IFERROR(VLOOKUP($D89,prezence!A:F,4,0),\"\")","v":""}]
[89,{"$f":"výsledky!B94","v":"00:00:00"},{"$f":"výsledky!C94","v":-0.011921296296296298},{"$f":"výsledky!D94","v":0},{"$f":"IFERROR(VLOOKUP($D90,prezence!A:F,2,0),\"\")","v":""},{"$f":"IFERROR(VLOOKUP($D90,prezence!A:F,3,0),\"\")","v":""},{"$f":"IFERROR(VLOOKUP($D90,prezence!A:F,4,0),\"\")","v":""}]
[90,{"$f":"výsledky!B95","v":"00:00:00"},{"$f":"výsledky!C95","v":-0.011921296296296298},{"$f":"výsledky!D95","v":0},{"$f":"IFERROR(VLOOKUP($D91,prezence!A:F,2,0),\"\")","v":""},{"$f":"IFERROR(VLOOKUP($D91,prezence!A:F,3,0),\"\")","v":""},{"$f":"IFERROR(VLOOKUP($D91,prezence!A:F,4,0),\"\")","v":""}]
[91,{"$f":"výsledky!B96","v":"00:00:00"},{"$f":"výsledky!C96","v":-0.011921296296296298},{"$f":"výsledky!D96","v":0},{"$f":"IFERROR(VLOOKUP($D92,prezence!A:F,2,0),\"\")","v":""},{"$f":"IFERROR(VLOOKUP($D92,prezence!A:F,3,0),\"\")","v":""},{"$f":"IFERROR(VLOOKUP($D92,prezence!A:F,4,0),\"\")","v":""}]
[92,{"$f":"výsledky!B97","v":"00:00:00"},{"$f":"výsledky!C97","v":-0.011921296296296298},{"$f":"výsledky!D97","v":0},{"$f":"IFERROR(VLOOKUP($D93,prezence!A:F,2,0),\"\")","v":""},{"$f":"IFERROR(VLOOKUP($D93,prezence!A:F,3,0),\"\")","v":""},{"$f":"IFERROR(VLOOKUP($D93,prezence!A:F,4,0),\"\")","v":""}]
[93,{"$f":"výsledky!B98","v":"00:00:00"},{"$f":"výsledky!C98","v":-0.011921296296296298},{"$f":"výsledky!D98","v":0},{"$f":"IFERROR(VLOOKUP($D94,prezence!A:F,2,0),\"\")","v":""},{"$f":"IFERROR(VLOOKUP($D94,prezence!A:F,3,0),\"\")","v":""},{"$f":"IFERROR(VLOOKUP($D94,prezence!A:F,4,0),\"\")","v":""}]
[94,{"$f":"výsledky!B99","v":"00:00:00"},{"$f":"výsledky!C99","v":-0.011921296296296298},{"$f":"výsledky!D99","v":0},{"$f":"IFERROR(VLOOKUP($D95,prezence!A:F,2,0),\"\")","v":""},{"$f":"IFERROR(VLOOKUP($D95,prezence!A:F,3,0),\"\")","v":""},{"$f":"IFERROR(VLOOKUP($D95,prezence!A:F,4,0),\"\")","v":""}]
[95,{"$f":"výsledky!B100","v":"00:00:00"},{"$f":"výsledky!C100","v":-0.011921296296296298},{"$f":"výsledky!D100","v":0},{"$f":"IFERROR(VLOOKUP($D96,prezence!A:F,2,0),\"\")","v":""},{"$f":"IFERROR(VLOOKUP($D96,prezence!A:F,3,0),\"\")","v":""},{"$f":"IFERROR(VLOOKUP($D96,prezence!A:F,4,0),\"\")","v":""}]
[96,{"$f":"výsledky!B101","v":"00:00:00"},{"$f":"výsledky!C101","v":-0.011921296296296298},{"$f":"výsledky!D101","v":0},{"$f":"IFERROR(VLOOKUP($D97,prezence!A:F,2,0),\"\")","v":""},{"$f":"IFERROR(VLOOKUP($D97,prezence!A:F,3,0),\"\")","v":""},{"$f":"IFERROR(VLOOKUP($D97,prezence!A:F,4,0),\"\")","v":""}]
[97,{"$f":"výsledky!B102","v":"00:00:00"},{"$f":"výsledky!C102","v":-0.011921296296296298},{"$f":"výsledky!D102","v":0},{"$f":"IFERROR(VLOOKUP($D98,prezence!A:F,2,0),\"\")","v":""},{"$f":"IFERROR(VLOOKUP($D98,prezence!A:F,3,0),\"\")","v":""},{"$f":"IFERROR(VLOOKUP($D98,prezence!A:F,4,0),\"\")","v":""}]
[98,{"$f":"výsledky!B103","v":"00:00:00"},{"$f":"výsledky!C103","v":-0.011921296296296298},{"$f":"výsledky!D103","v":0},{"$f":"IFERROR(VLOOKUP($D99,prezence!A:F,2,0),\"\")","v":""},{"$f":"IFERROR(VLOOKUP($D99,prezence!A:F,3,0),\"\")","v":""},{"$f":"IFERROR(VLOOKUP($D99,prezence!A:F,4,0),\"\")","v":""}]
[99,{"$f":"výsledky!B104","v":"00:00:00"},{"$f":"výsledky!C104","v":-0.011921296296296298},{"$f":"výsledky!D104","v":0},{"$f":"IFERROR(VLOOKUP($D100,prezence!A:F,2,0),\"\")","v":""},{"$f":"IFERROR(VLOOKUP($D100,prezence!A:F,3,0),\"\")","v":""},{"$f":"IFERROR(VLOOKUP($D100,prezence!A:F,4,0),\"\")","v":""}]
[100,{"$f":"výsledky!B105","v":"00:00:00"},{"$f":"výsledky!C105","v":-0.011921296296296298},{"$f":"výsledky!D105","v":0},{"$f":"IFERROR(VLOOKUP($D101,prezence!A:F,2,0),\"\")","v":""},{"$f":"IFERROR(VLOOKUP($D101,prezence!A:F,3,0),\"\")","v":""},{"$f":"IFERROR(VLOOKUP($D101,prezence!A:F,4,0),\"\")","v":""}]
[101,{"$f":"výsledky!B106","v":"00:00:00"},{"$f":"výsledky!C106","v":-0.011921296296296298},{"$f":"výsledky!D106","v":0},{"$f":"IFERROR(VLOOKUP($D102,prezence!A:F,2,0),\"\")","v":""},{"$f":"IFERROR(VLOOKUP($D102,prezence!A:F,3,0),\"\")","v":""},{"$f":"IFERROR(VLOOKUP($D102,prezence!A:F,4,0),\"\")","v":""}]
[102,{"$f":"výsledky!B107","v":"00:00:00"},{"$f":"výsledky!C107","v":-0.011921296296296298},{"$f":"výsledky!D107","v":0},{"$f":"IFERROR(VLOOKUP($D103,prezence!A:F,2,0),\"\")","v":""},{"$f":"IFERROR(VLOOKUP($D103,prezence!A:F,3,0),\"\")","v":""},{"$f":"IFERROR(VLOOKUP($D103,prezence!A:F,4,0),\"\")","v":""}]
[103,{"$f":"výsledky!B108","v":"00:00:00"},{"$f":"výsledky!C108","v":-0.011921296296296298},{"$f":"výsledky!D108","v":0},{"$f":"IFERROR(VLOOKUP($D104,prezence!A:F,2,0),\"\")","v":""},{"$f":"IFERROR(VLOOKUP($D104,prezence!A:F,3,0),\"\")","v":""},{"$f":"IFERROR(VLOOKUP($D104,prezence!A:F,4,0),\"\")","v":""}]
[104,{"$f":"výsledky!B109","v":"00:00:00"},{"$f":"výsledky!C109","v":-0.011921296296296298},{"$f":"výsledky!D109","v":0},{"$f":"IFERROR(VLOOKUP($D105,prezence!A:F,2,0),\"\")","v":""},{"$f":"IFERROR(VLOOKUP($D105,prezence!A:F,3,0),\"\")","v":""},{"$f":"IFERROR(VLOOKUP($D105,prezence!A:F,4,0),\"\")","v":""}]
[105,{"$f":"výsledky!B110","v":"00:00:00"},{"$f":"výsledky!C110","v":-0.011921296296296298},{"$f":"výsledky!D110","v":0},{"$f":"IFERROR(VLOOKUP($D106,prezence!A:F,2,0),\"\")","v":""},{"$f":"IFERROR(VLOOKUP($D106,prezence!A:F,3,0),\"\")","v":""},{"$f":"IFERROR(VLOOKUP($D106,prezence!A:F,4,0),\"\")","v":""}]
[106,{"$f":"výsledky!B111","v":"00:00:00"},{"$f":"výsledky!C111","v":-0.011921296296296298},{"$f":"výsledky!D111","v":0},{"$f":"IFERROR(VLOOKUP($D107,prezence!A:F,2,0),\"\")","v":""},{"$f":"IFERROR(VLOOKUP($D107,prezence!A:F,3,0),\"\")","v":""},{"$f":"IFERROR(VLOOKUP($D107,prezence!A:F,4,0),\"\")","v":""}]
[107,{"$f":"výsledky!B112","v":"00:00:00"},{"$f":"výsledky!C112","v":-0.011921296296296298},{"$f":"výsledky!D112","v":0},{"$f":"IFERROR(VLOOKUP($D108,prezence!A:F,2,0),\"\")","v":""},{"$f":"IFERROR(VLOOKUP($D108,prezence!A:F,3,0),\"\")","v":""},{"$f":"IFERROR(VLOOKUP($D108,prezence!A:F,4,0),\"\")","v":""}]
[108,{"$f":"výsledky!B113","v":"00:00:00"},{"$f":"výsledky!C113","v":-0.011921296296296298},{"$f":"výsledky!D113","v":0},{"$f":"IFERROR(VLOOKUP($D109,prezence!A:F,2,0),\"\")","v":""},{"$f":"IFERROR(VLOOKUP($D109,prezence!A:F,3,0),\"\")","v":""},{"$f":"IFERROR(VLOOKUP($D109,prezence!A:F,4,0),\"\")","v":""}]
[109,{"$f":"výsledky!B114","v":"00:00:00"},{"$f":"výsledky!C114","v":-0.011921296296296298},{"$f":"výsledky!D114","v":0},{"$f":"IFERROR(VLOOKUP($D110,prezence!A:F,2,0),\"\")","v":""},{"$f":"IFERROR(VLOOKUP($D110,prezence!A:F,3,0),\"\")","v":""},{"$f":"IFERROR(VLOOKUP($D110,prezence!A:F,4,0),\"\")","v":""}]
[110,{"$f":"výsledky!B115","v":"00:00:00"},{"$f":"výsledky!C115","v":-0.011921296296296298},{"$f":"výsledky!D115","v":0},{"$f":"IFERROR(VLOOKUP($D111,prezence!A:F,2,0),\"\")","v":""},{"$f":"IFERROR(VLOOKUP($D111,prezence!A:F,3,0),\"\")","v":""},{"$f":"IFERROR(VLOOKUP($D111,prezence!A:F,4,0),\"\")","v":""}]
[111,{"$f":"výsledky!B116","v":"00:00:00"},{"$f":"výsledky!C116","v":-0.011921296296296298},{"$f":"výsledky!D116","v":0},{"$f":"IFERROR(VLOOKUP($D112,prezence!A:F,2,0),\"\")","v":""},{"$f":"IFERROR(VLOOKUP($D112,prezence!A:F,3,0),\"\")","v":""},{"$f":"IFERROR(VLOOKUP($D112,prezence!A:F,4,0),\"\")","v":""}]
[112,{"$f":"výsledky!B117","v":"00:00:00"},{"$f":"výsledky!C117","v":-0.011921296296296298},{"$f":"výsledky!D117","v":0},{"$f":"IFERROR(VLOOKUP($D113,prezence!A:F,2,0),\"\")","v":""},{"$f":"IFERROR(VLOOKUP($D113,prezence!A:F,3,0),\"\")","v":""},{"$f":"IFERROR(VLOOKUP($D113,prezence!A:F,4,0),\"\")","v":""}]
[113,{"$f":"výsledky!B118","v":"00:00:00"},{"$f":"výsledky!C118","v":-0.011921296296296298},{"$f":"výsledky!D118","v":0},{"$f":"IFERROR(VLOOKUP($D114,prezence!A:F,2,0),\"\")","v":""},{"$f":"IFERROR(VLOOKUP($D114,prezence!A:F,3,0),\"\")","v":""},{"$f":"IFERROR(VLOOKUP($D114,prezence!A:F,4,0),\"\")","v":""}]
[114,{"$f":"výsledky!B119","v":"00:00:00"},{"$f":"výsledky!C119","v":-0.011921296296296298},{"$f":"výsledky!D119","v":0},{"$f":"IFERROR(VLOOKUP($D115,prezence!A:F,2,0),\"\")","v":""},{"$f":"IFERROR(VLOOKUP($D115,prezence!A:F,3,0),\"\")","v":""},{"$f":"IFERROR(VLOOKUP($D115,prezence!A:F,4,0),\"\")","v":""}]
[115,{"$f":"výsledky!B120","v":"00:00:00"},{"$f":"výsledky!C120","v":-0.011921296296296298},{"$f":"výsledky!D120","v":0},{"$f":"IFERROR(VLOOKUP($D116,prezence!A:F,2,0),\"\")","v":""},{"$f":"IFERROR(VLOOKUP($D116,prezence!A:F,3,0),\"\")","v":""},{"$f":"IFERROR(VLOOKUP($D116,prezence!A:F,4,0),\"\")","v":""}]
[116,{"$f":"výsledky!B121","v":"00:00:00"},{"$f":"výsledky!C121","v":-0.011921296296296298},{"$f":"výsledky!D121","v":0},{"$f":"IFERROR(VLOOKUP($D117,prezence!A:F,2,0),\"\")","v":""},{"$f":"IFERROR(VLOOKUP($D117,prezence!A:F,3,0),\"\")","v":""},{"$f":"IFERROR(VLOOKUP($D117,prezence!A:F,4,0),\"\")","v":""}]
[117,{"$f":"výsledky!B122","v":"00:00:00"},{"$f":"výsledky!C122","v":-0.011921296296296298},{"$f":"výsledky!D122","v":0},{"$f":"IFERROR(VLOOKUP($D118,prezence!A:F,2,0),\"\")","v":""},{"$f":"IFERROR(VLOOKUP($D118,prezence!A:F,3,0),\"\")","v":""},{"$f":"IFERROR(VLOOKUP($D118,prezence!A:F,4,0),\"\")","v":""}]
[118,{"$f":"výsledky!B123","v":"00:00:00"},{"$f":"výsledky!C123","v":-0.011921296296296298},{"$f":"výsledky!D123","v":0},{"$f":"IFERROR(VLOOKUP($D119,prezence!A:F,2,0),\"\")","v":""},{"$f":"IFERROR(VLOOKUP($D119,prezence!A:F,3,0),\"\")","v":""},{"$f":"IFERROR(VLOOKUP($D119,prezence!A:F,4,0),\"\")","v":""}]
[119,{"$f":"výsledky!B124","v":"00:00:00"},{"$f":"výsledky!C124","v":-0.011921296296296298},{"$f":"výsledky!D124","v":0},{"$f":"IFERROR(VLOOKUP($D120,prezence!A:F,2,0),\"\")","v":""},{"$f":"IFERROR(VLOOKUP($D120,prezence!A:F,3,0),\"\")","v":""},{"$f":"IFERROR(VLOOKUP($D120,prezence!A:F,4,0),\"\")","v":""}]
[120,{"$f":"výsledky!B125","v":"00:00:00"},{"$f":"výsledky!C125","v":-0.011921296296296298},{"$f":"výsledky!D125","v":0},{"$f":"IFERROR(VLOOKUP($D121,prezence!A:F,2,0),\"\")","v":""},{"$f":"IFERROR(VLOOKUP($D121,prezence!A:F,3,0),\"\")","v":""},{"$f":"IFERROR(VLOOKUP($D121,prezence!A:F,4,0),\"\")","v":""}]
[121,{"$f":"výsledky!B126","v":"00:00:00"},{"$f":"výsledky!C126","v":-0.011921296296296298},{"$f":"výsledky!D126","v":0},{"$f":"IFERROR(VLOOKUP($D122,prezence!A:F,2,0),\"\")","v":""},{"$f":"IFERROR(VLOOKUP($D122,prezence!A:F,3,0),\"\")","v":""},{"$f":"IFERROR(VLOOKUP($D122,prezence!A:F,4,0),\"\")","v":""}]
[122,{"$f":"výsledky!B127","v":"00:00:00"},{"$f":"výsledky!C127","v":-0.011921296296296298},{"$f":"výsledky!D127","v":0},{"$f":"IFERROR(VLOOKUP($D123,prezence!A:F,2,0),\"\")","v":""},{"$f":"IFERROR(VLOOKUP($D123,prezence!A:F,3,0),\"\")","v":""},{"$f":"IFERROR(VLOOKUP($D123,prezence!A:F,4,0),\"\")","v":""}]
[123,{"$f":"výsledky!B128","v":"00:00:00"},{"$f":"výsledky!C128","v":-0.011921296296296298},{"$f":"výsledky!D128","v":0},{"$f":"IFERROR(VLOOKUP($D124,prezence!A:F,2,0),\"\")","v":""},{"$f":"IFERROR(VLOOKUP($D124,prezence!A:F,3,0),\"\")","v":""},{"$f":"IFERROR(VLOOKUP($D124,prezence!A:F,4,0),\"\")","v":""}]
[124,{"$f":"výsledky!B129","v":"00:00:00"},{"$f":"výsledky!C129","v":-0.011921296296296298},{"$f":"výsledky!D129","v":0},{"$f":"IFERROR(VLOOKUP($D125,prezence!A:F,2,0),\"\")","v":""},{"$f":"IFERROR(VLOOKUP($D125,prezence!A:F,3,0),\"\")","v":""},{"$f":"IFERROR(VLOOKUP($D125,prezence!A:F,4,0),\"\")","v":""}]
[125,{"$f":"výsledky!B130","v":"00:00:00"},{"$f":"výsledky!C130","v":-0.011921296296296298},{"$f":"výsledky!D130","v":0},{"$f":"IFERROR(VLOOKUP($D126,prezence!A:F,2,0),\"\")","v":""},{"$f":"IFERROR(VLOOKUP($D126,prezence!A:F,3,0),\"\")","v":""},{"$f":"IFERROR(VLOOKUP($D126,prezence!A:F,4,0),\"\")","v":""}]
[126,{"$f":"výsledky!B131","v":"00:00:00"},{"$f":"výsledky!C131","v":-0.011921296296296298},{"$f":"výsledky!D131","v":0},{"$f":"IFERROR(VLOOKUP($D127,prezence!A:F,2,0),\"\")","v":""},{"$f":"IFERROR(VLOOKUP($D127,prezence!A:F,3,0),\"\")","v":""},{"$f":"IFERROR(VLOOKUP($D127,prezence!A:F,4,0),\"\")","v":""}]
[127,{"$f":"výsledky!B132","v":"00:00:00"},{"$f":"výsledky!C132","v":-0.011921296296296298},{"$f":"výsledky!D132","v":0},{"$f":"IFERROR(VLOOKUP($D128,prezence!A:F,2,0),\"\")","v":""},{"$f":"IFERROR(VLOOKUP($D128,prezence!A:F,3,0),\"\")","v":""},{"$f":"IFERROR(VLOOKUP($D128,prezence!A:F,4,0),\"\")","v":""}]
[128,{"$f":"výsledky!B133","v":"00:00:00"},{"$f":"výsledky!C133","v":-0.011921296296296298},{"$f":"výsledky!D133","v":0},{"$f":"IFERROR(VLOOKUP($D129,prezence!A:F,2,0),\"\")","v":""},{"$f":"IFERROR(VLOOKUP($D129,prezence!A:F,3,0),\"\")","v":""},{"$f":"IFERROR(VLOOKUP($D129,prezence!A:F,4,0),\"\")","v":""}]
[129,{"$f":"výsledky!B134","v":"00:00:00"},{"$f":"výsledky!C134","v":-0.011921296296296298},{"$f":"výsledky!D134","v":0},{"$f":"IFERROR(VLOOKUP($D130,prezence!A:F,2,0),\"\")","v":""},{"$f":"IFERROR(VLOOKUP($D130,prezence!A:F,3,0),\"\")","v":""},{"$f":"IFERROR(VLOOKUP($D130,prezence!A:F,4,0),\"\")","v":""}]
[130,{"$f":"výsledky!B135","v":"00:00:00"},{"$f":"výsledky!C135","v":-0.011921296296296298},{"$f":"výsledky!D135","v":0},{"$f":"IFERROR(VLOOKUP($D131,prezence!A:F,2,0),\"\")","v":""},{"$f":"IFERROR(VLOOKUP($D131,prezence!A:F,3,0),\"\")","v":""},{"$f":"IFERROR(VLOOKUP($D131,prezence!A:F,4,0),\"\")","v":""}]
[131,{"$f":"výsledky!B136","v":"00:00:00"},{"$f":"výsledky!C136","v":-0.011921296296296298},{"$f":"výsledky!D136","v":0},{"$f":"IFERROR(VLOOKUP($D132,prezence!A:F,2,0),\"\")","v":""},{"$f":"IFERROR(VLOOKUP($D132,prezence!A:F,3,0),\"\")","v":""},{"$f":"IFERROR(VLOOKUP($D132,prezence!A:F,4,0),\"\")","v":""}]
[132,{"$f":"výsledky!B137","v":"00:00:00"},{"$f":"výsledky!C137","v":-0.011921296296296298},{"$f":"výsledky!D137","v":0},{"$f":"IFERROR(VLOOKUP($D133,prezence!A:F,2,0),\"\")","v":""},{"$f":"IFERROR(VLOOKUP($D133,prezence!A:F,3,0),\"\")","v":""},{"$f":"IFERROR(VLOOKUP($D133,prezence!A:F,4,0),\"\")","v":""}]
[133,{"$f":"výsledky!B138","v":"00:00:00"},{"$f":"výsledky!C138","v":-0.011921296296296298},{"$f":"výsledky!D138","v":0},{"$f":"IFERROR(VLOOKUP($D134,prezence!A:F,2,0),\"\")","v":""},{"$f":"IFERROR(VLOOKUP($D134,prezence!A:F,3,0),\"\")","v":""},{"$f":"IFERROR(VLOOKUP($D134,prezence!A:F,4,0),\"\")","v":""}]
[134,{"$f":"výsledky!B139","v":"00:00:00"},{"$f":"výsledky!C139","v":-0.011921296296296298},{"$f":"výsledky!D139","v":0},{"$f":"IFERROR(VLOOKUP($D135,prezence!A:F,2,0),\"\")","v":""},{"$f":"IFERROR(VLOOKUP($D135,prezence!A:F,3,0),\"\")","v":""},{"$f":"IFERROR(VLOOKUP($D135,prezence!A:F,4,0),\"\")","v":""}]
[135,{"$f":"výsledky!B140","v":"00:00:00"},{"$f":"výsledky!C140","v":-0.011921296296296298},{"$f":"výsledky!D140","v":0},{"$f":"IFERROR(VLOOKUP($D136,prezence!A:F,2,0),\"\")","v":""},{"$f":"IFERROR(VLOOKUP($D136,prezence!A:F,3,0),\"\")","v":""},{"$f":"IFERROR(VLOOKUP($D136,prezence!A:F,4,0),\"\")","v":""}]
[136,{"$f":"výsledky!B141","v":"00:00:00"},{"$f":"výsledky!C141","v":-0.011921296296296298},{"$f":"výsledky!D141","v":0},{"$f":"IFERROR(VLOOKUP($D137,prezence!A:F,2,0),\"\")","v":""},{"$f":"IFERROR(VLOOKUP($D137,prezence!A:F,3,0),\"\")","v":""},{"$f":"IFERROR(VLOOKUP($D137,prezence!A:F,4,0),\"\")","v":""}]
[137,{"$f":"výsledky!B142","v":"00:00:00"},{"$f":"výsledky!C142","v":-0.011921296296296298},{"$f":"výsledky!D142","v":0},{"$f":"IFERROR(VLOOKUP($D138,prezence!A:F,2,0),\"\")","v":""},{"$f":"IFERROR(VLOOKUP($D138,prezence!A:F,3,0),\"\")","v":""},{"$f":"IFERROR(VLOOKUP($D138,prezence!A:F,4,0),\"\")","v":""}]
[138,{"$f":"výsledky!B143","v":"00:00:00"},{"$f":"výsledky!C143","v":-0.011921296296296298},{"$f":"výsledky!D143","v":0},{"$f":"IFERROR(VLOOKUP($D139,prezence!A:F,2,0),\"\")","v":""},{"$f":"IFERROR(VLOOKUP($D139,prezence!A:F,3,0),\"\")","v":""},{"$f":"IFERROR(VLOOKUP($D139,prezence!A:F,4,0),\"\")","v":""}]
[139,{"$f":"výsledky!B144","v":"00:00:00"},{"$f":"výsledky!C144","v":-0.011921296296296298},{"$f":"výsledky!D144","v":0},{"$f":"IFERROR(VLOOKUP($D140,prezence!A:F,2,0),\"\")","v":""},{"$f":"IFERROR(VLOOKUP($D140,prezence!A:F,3,0),\"\")","v":""},{"$f":"IFERROR(VLOOKUP($D140,prezence!A:F,4,0),\"\")","v":""}]
[140,{"$f":"výsledky!B145","v":"00:00:00"},{"$f":"výsledky!C145","v":-0.011921296296296298},{"$f":"výsledky!D145","v":0},{"$f":"IFERROR(VLOOKUP($D141,prezence!A:F,2,0),\"\")","v":""},{"$f":"IFERROR(VLOOKUP($D141,prezence!A:F,3,0),\"\")","v":""},{"$f":"IFERROR(VLOOKUP($D141,prezence!A:F,4,0),\"\")","v":""}]
[141,{"$f":"výsledky!B146","v":"00:00:00"},{"$f":"výsledky!C146","v":-0.011921296296296298},{"$f":"výsledky!D146","v":0},{"$f":"IFERROR(VLOOKUP($D142,prezence!A:F,2,0),\"\")","v":""},{"$f":"IFERROR(VLOOKUP($D142,prezence!A:F,3,0),\"\")","v":""},{"$f":"IFERROR(VLOOKUP($D142,prezence!A:F,4,0),\"\")","v":""}]
[142,{"$f":"výsledky!B147","v":"00:00:00"},{"$f":"výsledky!C147","v":-0.011921296296296298},{"$f":"výsledky!D147","v":0},{"$f":"IFERROR(VLOOKUP($D143,prezence!A:F,2,0),\"\")","v":""},{"$f":"IFERROR(VLOOKUP($D143,prezence!A:F,3,0),\"\")","v":""},{"$f":"IFERROR(VLOOKUP($D143,prezence!A:F,4,0),\"\")","v":""}]
[143,{"$f":"výsledky!B148","v":"00:00:00"},{"$f":"výsledky!C148","v":-0.011921296296296298},{"$f":"výsledky!D148","v":0},{"$f":"IFERROR(VLOOKUP($D144,prezence!A:F,2,0),\"\")","v":""},{"$f":"IFERROR(VLOOKUP($D144,prezence!A:F,3,0),\"\")","v":""},{"$f":"IFERROR(VLOOKUP($D144,prezence!A:F,4,0),\"\")","v":""}]
[144,{"$f":"výsledky!B149","v":"00:00:00"},{"$f":"výsledky!C149","v":-0.011921296296296298},{"$f":"výsledky!D149","v":0},{"$f":"IFERROR(VLOOKUP($D145,prezence!A:F,2,0),\"\")","v":""},{"$f":"IFERROR(VLOOKUP($D145,prezence!A:F,3,0),\"\")","v":""},{"$f":"IFERROR(VLOOKUP($D145,prezence!A:F,4,0),\"\")","v":""}]
[145,{"$f":"výsledky!B150","v":"00:00:00"},{"$f":"výsledky!C150","v":-0.011921296296296298},{"$f":"výsledky!D150","v":0},{"$f":"IFERROR(VLOOKUP($D146,prezence!A:F,2,0),\"\")","v":""},{"$f":"IFERROR(VLOOKUP($D146,prezence!A:F,3,0),\"\")","v":""},{"$f":"IFERROR(VLOOKUP($D146,prezence!A:F,4,0),\"\")","v":""}]
[146,{"$f":"výsledky!B151","v":"00:00:00"},{"$f":"výsledky!C151","v":-0.011921296296296298},{"$f":"výsledky!D151","v":0},{"$f":"IFERROR(VLOOKUP($D147,prezence!A:F,2,0),\"\")","v":""},{"$f":"IFERROR(VLOOKUP($D147,prezence!A:F,3,0),\"\")","v":""},{"$f":"IFERROR(VLOOKUP($D147,prezence!A:F,4,0),\"\")","v":""}]
[147,{"$f":"výsledky!B152","v":"00:00:00"},{"$f":"výsledky!C152","v":-0.011921296296296298},{"$f":"výsledky!D152","v":0},{"$f":"IFERROR(VLOOKUP($D148,prezence!A:F,2,0),\"\")","v":""},{"$f":"IFERROR(VLOOKUP($D148,prezence!A:F,3,0),\"\")","v":""},{"$f":"IFERROR(VLOOKUP($D148,prezence!A:F,4,0),\"\")","v":""}]
[148,{"$f":"výsledky!B153","v":"00:00:00"},{"$f":"výsledky!C153","v":-0.011921296296296298},{"$f":"výsledky!D153","v":0},{"$f":"IFERROR(VLOOKUP($D149,prezence!A:F,2,0),\"\")","v":""},{"$f":"IFERROR(VLOOKUP($D149,prezence!A:F,3,0),\"\")","v":""},{"$f":"IFERROR(VLOOKUP($D149,prezence!A:F,4,0),\"\")","v":""}]
[149,{"$f":"výsledky!B154","v":"00:00:00"},{"$f":"výsledky!C154","v":-0.011921296296296298},{"$f":"výsledky!D154","v":0},{"$f":"IFERROR(VLOOKUP($D150,prezence!A:F,2,0),\"\")","v":""},{"$f":"IFERROR(VLOOKUP($D150,prezence!A:F,3,0),\"\")","v":""},{"$f":"IFERROR(VLOOKUP($D150,prezence!A:F,4,0),\"\")","v":""}]
[150,{"$f":"výsledky!B155","v":"00:00:00"},{"$f":"výsledky!C155","v":-0.011921296296296298},{"$f":"výsledky!D155","v":0},{"$f":"IFERROR(VLOOKUP($D151,prezence!A:F,2,0),\"\")","v":""},{"$f":"IFERROR(VLOOKUP($D151,prezence!A:F,3,0),\"\")","v":""},{"$f":"IFERROR(VLOOKUP($D151,prezence!A:F,4,0),\"\")","v":""}]
[151,{"$f":"výsledky!B156","v":"00:00:00"},{"$f":"výsledky!C156","v":-0.011921296296296298},{"$f":"výsledky!D156","v":0},{"$f":"IFERROR(VLOOKUP($D152,prezence!A:F,2,0),\"\")","v":""},{"$f":"IFERROR(VLOOKUP($D152,prezence!A:F,3,0),\"\")","v":""},{"$f":"IFERROR(VLOOKUP($D152,prezence!A:F,4,0),\"\")","v":""}]
[152,{"$f":"výsledky!B157","v":"00:00:00"},{"$f":"výsledky!C157","v":-0.011921296296296298},{"$f":"výsledky!D157","v":0},{"$f":"IFERROR(VLOOKUP($D153,prezence!A:F,2,0),\"\")","v":""},{"$f":"IFERROR(VLOOKUP($D153,prezence!A:F,3,0),\"\")","v":""},{"$f":"IFERROR(VLOOKUP($D153,prezence!A:F,4,0),\"\")","v":""}]
[153,{"$f":"výsledky!B158","v":"00:00:00"},{"$f":"výsledky!C158","v":-0.011921296296296298},{"$f":"výsledky!D158","v":0},{"$f":"IFERROR(VLOOKUP($D154,prezence!A:F,2,0),\"\")","v":""},{"$f":"IFERROR(VLOOKUP($D154,prezence!A:F,3,0),\"\")","v":""},{"$f":"IFERROR(VLOOKUP($D154,prezence!A:F,4,0),\"\")","v":""}]
[154,{"$f":"výsledky!B159","v":"00:00:00"},{"$f":"výsledky!C159","v":-0.011921296296296298},{"$f":"výsledky!D159","v":0},{"$f":"IFERROR(VLOOKUP($D155,prezence!A:F,2,0),\"\")","v":""},{"$f":"IFERROR(VLOOKUP($D155,prezence!A:F,3,0),\"\")","v":""},{"$f":"IFERROR(VLOOKUP($D155,prezence!A:F,4,0),\"\")","v":""}]
[155,{"$f":"výsledky!B160","v":"00:00:00"},{"$f":"výsledky!C160","v":-0.011921296296296298},{"$f":"výsledky!D160","v":0},{"$f":"IFERROR(VLOOKUP($D156,prezence!A:F,2,0),\"\")","v":""},{"$f":"IFERROR(VLOOKUP($D156,prezence!A:F,3,0),\"\")","v":""},{"$f":"IFERROR(VLOOKUP($D156,prezence!A:F,4,0),\"\")","v":""}]
[156,{"$f":"výsledky!B161","v":"00:00:00"},{"$f":"výsledky!C161","v":-0.011921296296296298},{"$f":"výsledky!D161","v":0},{"$f":"IFERROR(VLOOKUP($D157,prezence!A:F,2,0),\"\")","v":""},{"$f":"IFERROR(VLOOKUP($D157,prezence!A:F,3,0),\"\")","v":""},{"$f":"IFERROR(VLOOKUP($D157,prezence!A:F,4,0),\"\")","v":""}]
[157,{"$f":"výsledky!B162","v":"00:00:00"},{"$f":"výsledky!C162","v":-0.011921296296296298},{"$f":"výsledky!D162","v":0},{"$f":"IFERROR(VLOOKUP($D158,prezence!A:F,2,0),\"\")","v":""},{"$f":"IFERROR(VLOOKUP($D158,prezence!A:F,3,0),\"\")","v":""},{"$f":"IFERROR(VLOOKUP($D158,prezence!A:F,4,0),\"\")","v":""}]
[158,{"$f":"výsledky!B163","v":"00:00:00"},{"$f":"výsledky!C163","v":-0.011921296296296298},{"$f":"výsledky!D163","v":0},{"$f":"IFERROR(VLOOKUP($D159,prezence!A:F,2,0),\"\")","v":""},{"$f":"IFERROR(VLOOKUP($D159,prezence!A:F,3,0),\"\")","v":""},{"$f":"IFERROR(VLOOKUP($D159,prezence!A:F,4,0),\"\")","v":""}]
[159,{"$f":"výsledky!B164","v":"00:00:00"},{"$f":"výsledky!C164","v":-0.011921296296296298},{"$f":"výsledky!D164","v":0},{"$f":"IFERROR(VLOOKUP($D160,prezence!A:F,2,0),\"\")","v":""},{"$f":"IFERROR(VLOOKUP($D160,prezence!A:F,3,0),\"\")","v":""},{"$f":"IFERROR(VLOOKUP($D160,prezence!A:F,4,0),\"\")","v":""}]
[160,{"$f":"výsledky!B165","v":"00:00:00"},{"$f":"výsledky!C165","v":-0.011921296296296298},{"$f":"výsledky!D165","v":0},{"$f":"IFERROR(VLOOKUP($D161,prezence!A:F,2,0),\"\")","v":""},{"$f":"IFERROR(VLOOKUP($D161,prezence!A:F,3,0),\"\")","v":""},{"$f":"IFERROR(VLOOKUP($D161,prezence!A:F,4,0),\"\")","v":""}]
[161,{"$f":"výsledky!B166","v":"00:00:00"},{"$f":"výsledky!C166","v":-0.011921296296296298},{"$f":"výsledky!D166","v":0},{"$f":"IFERROR(VLOOKUP($D162,prezence!A:F,2,0),\"\")","v":""},{"$f":"IFERROR(VLOOKUP($D162,prezence!A:F,3,0),\"\")","v":""},{"$f":"IFERROR(VLOOKUP($D162,prezence!A:F,4,0),\"\")","v":""}]
[162,{"$f":"výsledky!B167","v":"00:00:00"},{"$f":"výsledky!C167","v":-0.011921296296296298},{"$f":"výsledky!D167","v":0},{"$f":"IFERROR(VLOOKUP($D163,prezence!A:F,2,0),\"\")","v":""},{"$f":"IFERROR(VLOOKUP($D163,prezence!A:F,3,0),\"\")","v":""},{"$f":"IFERROR(VLOOKUP($D163,prezence!A:F,4,0),\"\")","v":""}]
[163,{"$f":"výsledky!B168","v":"00:00:00"},{"$f":"výsledky!C168","v":-0.011921296296296298},{"$f":"výsledky!D168","v":0},{"$f":"IFERROR(VLOOKUP($D164,prezence!A:F,2,0),\"\")","v":""},{"$f":"IFERROR(VLOOKUP($D164,prezence!A:F,3,0),\"\")","v":""},{"$f":"IFERROR(VLOOKUP($D164,prezence!A:F,4,0),\"\")","v":""}]
[164,{"$f":"výsledky!B169","v":"00:00:00"},{"$f":"výsledky!C169","v":-0.011921296296296298},{"$f":"výsledky!D169","v":0},{"$f":"IFERROR(VLOOKUP($D165,prezence!A:F,2,0),\"\")","v":""},{"$f":"IFERROR(VLOOKUP($D165,prezence!A:F,3,0),\"\")","v":""},{"$f":"IFERROR(VLOOKUP($D165,prezence!A:F,4,0),\"\")","v":""}]
[165,{"$f":"výsledky!B170","v":"00:00:00"},{"$f":"výsledky!C170","v":-0.011921296296296298},{"$f":"výsledky!D170","v":0},{"$f":"IFERROR(VLOOKUP($D166,prezence!A:F,2,0),\"\")","v":""},{"$f":"IFERROR(VLOOKUP($D166,prezence!A:F,3,0),\"\")","v":""},{"$f":"IFERROR(VLOOKUP($D166,prezence!A:F,4,0),\"\")","v":""}]
[166,{"$f":"výsledky!B171","v":"00:00:00"},{"$f":"výsledky!C171","v":-0.011921296296296298},{"$f":"výsledky!D171","v":0},{"$f":"IFERROR(VLOOKUP($D167,prezence!A:F,2,0),\"\")","v":""},{"$f":"IFERROR(VLOOKUP($D167,prezence!A:F,3,0),\"\")","v":""},{"$f":"IFERROR(VLOOKUP($D167,prezence!A:F,4,0),\"\")","v":""}]
[167,{"$f":"výsledky!B172","v":"00:00:00"},{"$f":"výsledky!C172","v":-0.011921296296296298},{"$f":"výsledky!D172","v":0},{"$f":"IFERROR(VLOOKUP($D168,prezence!A:F,2,0),\"\")","v":""},{"$f":"IFERROR(VLOOKUP($D168,prezence!A:F,3,0),\"\")","v":""},{"$f":"IFERROR(VLOOKUP($D168,prezence!A:F,4,0),\"\")","v":""}]
[168,{"$f":"výsledky!B173","v":"00:00:00"},{"$f":"výsledky!C173","v":-0.011921296296296298},{"$f":"výsledky!D173","v":0},{"$f":"IFERROR(VLOOKUP($D169,prezence!A:F,2,0),\"\")","v":""},{"$f":"IFERROR(VLOOKUP($D169,prezence!A:F,3,0),\"\")","v":""},{"$f":"IFERROR(VLOOKUP($D169,prezence!A:F,4,0),\"\")","v":""}]
[169,{"$f":"výsledky!B174","v":"00:00:00"},{"$f":"výsledky!C174","v":-0.011921296296296298},{"$f":"výsledky!D174","v":0},{"$f":"IFERROR(VLOOKUP($D170,prezence!A:F,2,0),\"\")","v":""},{"$f":"IFERROR(VLOOKUP($D170,prezence!A:F,3,0),\"\")","v":""},{"$f":"IFERROR(VLOOKUP($D170,prezence!A:F,4,0),\"\")","v":""}]
[170,{"$f":"výsledky!B175","v":"00:00:00"},{"$f":"výsledky!C175","v":-0.011921296296296298},{"$f":"výsledky!D175","v":0},{"$f":"IFERROR(VLOOKUP($D171,prezence!A:F,2,0),\"\")","v":""},{"$f":"IFERROR(VLOOKUP($D171,prezence!A:F,3,0),\"\")","v":""},{"$f":"IFERROR(VLOOKUP($D171,prezence!A:F,4,0),\"\")","v":""}]
[171,{"$f":"výsledky!B176","v":"00:00:00"},{"$f":"výsledky!C176","v":-0.011921296296296298},{"$f":"výsledky!D176","v":0},{"$f":"IFERROR(VLOOKUP($D172,prezence!A:F,2,0),\"\")","v":""},{"$f":"IFERROR(VLOOKUP($D172,prezence!A:F,3,0),\"\")","v":""},{"$f":"IFERROR(VLOOKUP($D172,prezence!A:F,4,0),\"\")","v":""}]
[172,{"$f":"výsledky!B177","v":"00:00:00"},{"$f":"výsledky!C177","v":-0.011921296296296298},{"$f":"výsledky!D177","v":0},{"$f":"IFERROR(VLOOKUP($D173,prezence!A:F,2,0),\"\")","v":""},{"$f":"IFERROR(VLOOKUP($D173,prezence!A:F,3,0),\"\")","v":""},{"$f":"IFERROR(VLOOKUP($D173,prezence!A:F,4,0),\"\")","v":""}]
[173,{"$f":"výsledky!B178","v":"00:00:00"},{"$f":"výsledky!C178","v":-0.011921296296296298},{"$f":"výsledky!D178","v":0},{"$f":"IFERROR(VLOOKUP($D174,prezence!A:F,2,0),\"\")","v":""},{"$f":"IFERROR(VLOOKUP($D174,prezence!A:F,3,0),\"\")","v":""},{"$f":"IFERROR(VLOOKUP($D174,prezence!A:F,4,0),\"\")","v":""}]
[174,{"$f":"výsledky!B179","v":"00:00:00"},{"$f":"výsledky!C179","v":-0.011921296296296298},{"$f":"výsledky!D179","v":0},{"$f":"IFERROR(VLOOKUP($D175,prezence!A:F,2,0),\"\")","v":""},{"$f":"IFERROR(VLOOKUP($D175,prezence!A:F,3,0),\"\")","v":""},{"$f":"IFERROR(VLOOKUP($D175,prezence!A:F,4,0),\"\")","v":""}]
[175,{"$f":"výsledky!B180","v":"00:00:00"},{"$f":"výsledky!C180","v":-0.011921296296296298},{"$f":"výsledky!D180","v":0},{"$f":"IFERROR(VLOOKUP($D176,prezence!A:F,2,0),\"\")","v":""},{"$f":"IFERROR(VLOOKUP($D176,prezence!A:F,3,0),\"\")","v":""},{"$f":"IFERROR(VLOOKUP($D176,prezence!A:F,4,0),\"\")","v":""}]
[176,{"$f":"výsledky!B181","v":"00:00:00"},{"$f":"výsledky!C181","v":-0.011921296296296298},{"$f":"výsledky!D181","v":0},{"$f":"IFERROR(VLOOKUP($D177,prezence!A:F,2,0),\"\")","v":""},{"$f":"IFERROR(VLOOKUP($D177,prezence!A:F,3,0),\"\")","v":""},{"$f":"IFERROR(VLOOKUP($D177,prezence!A:F,4,0),\"\")","v":""}]
[177,{"$f":"výsledky!B182","v":"00:00:00"},{"$f":"výsledky!C182","v":-0.011921296296296298},{"$f":"výsledky!D182","v":0},{"$f":"IFERROR(VLOOKUP($D178,prezence!A:F,2,0),\"\")","v":""},{"$f":"IFERROR(VLOOKUP($D178,prezence!A:F,3,0),\"\")","v":""},{"$f":"IFERROR(VLOOKUP($D178,prezence!A:F,4,0),\"\")","v":""}]
[178,{"$f":"výsledky!B183","v":"00:00:00"},{"$f":"výsledky!C183","v":-0.011921296296296298},{"$f":"výsledky!D183","v":0},{"$f":"IFERROR(VLOOKUP($D179,prezence!A:F,2,0),\"\")","v":""},{"$f":"IFERROR(VLOOKUP($D179,prezence!A:F,3,0),\"\")","v":""},{"$f":"IFERROR(VLOOKUP($D179,prezence!A:F,4,0),\"\")","v":""}]
[179,{"$f":"výsledky!B184","v":"00:00:00"},{"$f":"výsledky!C184","v":-0.011921296296296298},{"$f":"výsledky!D184","v":0},{"$f":"IFERROR(VLOOKUP($D180,prezence!A:F,2,0),\"\")","v":""},{"$f":"IFERROR(VLOOKUP($D180,prezence!A:F,3,0),\"\")","v":""},{"$f":"IFERROR(VLOOKUP($D180,prezence!A:F,4,0),\"\")","v":""}]
[180,{"$f":"výsledky!B185","v":"00:00:00"},{"$f":"výsledky!C185","v":-0.011921296296296298},{"$f":"výsledky!D185","v":0},{"$f":"IFERROR(VLOOKUP($D181,prezence!A:F,2,0),\"\")","v":""},{"$f":"IFERROR(VLOOKUP($D181,prezence!A:F,3,0),\"\")","v":""},{"$f":"IFERROR(VLOOKUP($D181,prezence!A:F,4,0),\"\")","v":""}]
[181,{"$f":"výsledky!B186","v":"00:00:00"},{"$f":"výsledky!C186","v":-0.011921296296296298},{"$f":"výsledky!D186","v":0},{"$f":"IFERROR(VLOOKUP($D182,prezence!A:F,2,0),\"\")","v":""},{"$f":"IFERROR(VLOOKUP($D182,prezence!A:F,3,0),\"\")","v":""},{"$f":"IFERROR(VLOOKUP($D182,prezence!A:F,4,0),\"\")","v":""}]
[182,{"$f":"výsledky!B187","v":"00:00:00"},{"$f":"výsledky!C187","v":-0.011921296296296298},{"$f":"výsledky!D187","v":0},{"$f":"IFERROR(VLOOKUP($D183,prezence!A:F,2,0),\"\")","v":""},{"$f":"IFERROR(VLOOKUP($D183,prezence!A:F,3,0),\"\")","v":""},{"$f":"IFERROR(VLOOKUP($D183,prezence!A:F,4,0),\"\")","v":""}]
[183,{"$f":"výsledky!B188","v":"00:00:00"},{"$f":"výsledky!C188","v":-0.011921296296296298},{"$f":"výsledky!D188","v":0},{"$f":"IFERROR(VLOOKUP($D184,prezence!A:F,2,0),\"\")","v":""},{"$f":"IFERROR(VLOOKUP($D184,prezence!A:F,3,0),\"\")","v":""},{"$f":"IFERROR(VLOOKUP($D184,prezence!A:F,4,0),\"\")","v":""}]
[184,{"$f":"výsledky!B189","v":"00:00:00"},{"$f":"výsledky!C189","v":-0.011921296296296298},{"$f":"výsledky!D189","v":0},{"$f":"IFERROR(VLOOKUP($D185,prezence!A:F,2,0),\"\")","v":""},{"$f":"IFERROR(VLOOKUP($D185,prezence!A:F,3,0),\"\")","v":""},{"$f":"IFERROR(VLOOKUP($D185,prezence!A:F,4,0),\"\")","v":""}]
[185,{"$f":"výsledky!B190","v":"00:00:00"},{"$f":"výsledky!C190","v":-0.011921296296296298},{"$f":"výsledky!D190","v":0},{"$f":"IFERROR(VLOOKUP($D186,prezence!A:F,2,0),\"\")","v":""},{"$f":"IFERROR(VLOOKUP($D186,prezence!A:F,3,0),\"\")","v":""},{"$f":"IFERROR(VLOOKUP($D186,prezence!A:F,4,0),\"\")","v":""}]
[186,{"$f":"výsledky!B191","v":"00:00:00"},{"$f":"výsledky!C191","v":-0.011921296296296298},{"$f":"výsledky!D191","v":0},{"$f":"IFERROR(VLOOKUP($D187,prezence!A:F,2,0),\"\")","v":""},{"$f":"IFERROR(VLOOKUP($D187,prezence!A:F,3,0),\"\")","v":""},{"$f":"IFERROR(VLOOKUP($D187,prezence!A:F,4,0),\"\")","v":""}]
[187,{"$f":"výsledky!B192","v":"00:00:00"},{"$f":"výsledky!C192","v":-0.011921296296296298},{"$f":"výsledky!D192","v":0},{"$f":"IFERROR(VLOOKUP($D188,prezence!A:F,2,0),\"\")","v":""},{"$f":"IFERROR(VLOOKUP($D188,prezence!A:F,3,0),\"\")","v":""},{"$f":"IFERROR(VLOOKUP($D188,prezence!A:F,4,0),\"\")","v":""}]
[188,{"$f":"výsledky!B193","v":"00:00:00"},{"$f":"výsledky!C193","v":-0.011921296296296298},{"$f":"výsledky!D193","v":0},{"$f":"IFERROR(VLOOKUP($D189,prezence!A:F,2,0),\"\")","v":""},{"$f":"IFERROR(VLOOKUP($D189,prezence!A:F,3,0),\"\")","v":""},{"$f":"IFERROR(VLOOKUP($D189,prezence!A:F,4,0),\"\")","v":""}]
[189,{"$f":"výsledky!B194","v":"00:00:00"},{"$f":"výsledky!C194","v":-0.011921296296296298},{"$f":"výsledky!D194","v":0},{"$f":"IFERROR(VLOOKUP($D190,prezence!A:F,2,0),\"\")","v":""},{"$f":"IFERROR(VLOOKUP($D190,prezence!A:F,3,0),\"\")","v":""},{"$f":"IFERROR(VLOOKUP($D190,prezence!A:F,4,0),\"\")","v":""}]
[190,{"$f":"výsledky!B195","v":"00:00:00"},{"$f":"výsledky!C195","v":-0.011921296296296298},{"$f":"výsledky!D195","v":0},{"$f":"IFERROR(VLOOKUP($D191,prezence!A:F,2,0),\"\")","v":""},{"$f":"IFERROR(VLOOKUP($D191,prezence!A:F,3,0),\"\")","v":""},{"$f":"IFERROR(VLOOKUP($D191,prezence!A:F,4,0),\"\")","v":""}]
[191,{"$f":"výsledky!B196","v":"00:00:00"},{"$f":"výsledky!C196","v":-0.011921296296296298},{"$f":"výsledky!D196","v":0},{"$f":"IFERROR(VLOOKUP($D192,prezence!A:F,2,0),\"\")","v":""},{"$f":"IFERROR(VLOOKUP($D192,prezence!A:F,3,0),\"\")","v":""},{"$f":"IFERROR(VLOOKUP($D192,prezence!A:F,4,0),\"\")","v":""}]
[192,{"$f":"výsledky!B197","v":"00:00:00"},{"$f":"výsledky!C197","v":-0.011921296296296298},{"$f":"výsledky!D197","v":0},{"$f":"IFERROR(VLOOKUP($D193,prezence!A:F,2,0),\"\")","v":""},{"$f":"IFERROR(VLOOKUP($D193,prezence!A:F,3,0),\"\")","v":""},{"$f":"IFERROR(VLOOKUP($D193,prezence!A:F,4,0),\"\")","v":""}]
[193,{"$f":"výsledky!B198","v":"00:00:00"},{"$f":"výsledky!C198","v":-0.011921296296296298},{"$f":"výsledky!D198","v":0},{"$f":"IFERROR(VLOOKUP($D194,prezence!A:F,2,0),\"\")","v":""},{"$f":"IFERROR(VLOOKUP($D194,prezence!A:F,3,0),\"\")","v":""},{"$f":"IFERROR(VLOOKUP($D194,prezence!A:F,4,0),\"\")","v":""}]
[194,{"$f":"výsledky!B199","v":"00:00:00"},{"$f":"výsledky!C199","v":-0.011921296296296298},{"$f":"výsledky!D199","v":0},{"$f":"IFERROR(VLOOKUP($D195,prezence!A:F,2,0),\"\")","v":""},{"$f":"IFERROR(VLOOKUP($D195,prezence!A:F,3,0),\"\")","v":""},{"$f":"IFERROR(VLOOKUP($D195,prezence!A:F,4,0),\"\")","v":""}]
[195,{"$f":"výsledky!B200","v":"00:00:00"},{"$f":"výsledky!C200","v":-0.011921296296296298},{"$f":"výsledky!D200","v":0},{"$f":"IFERROR(VLOOKUP($D196,prezence!A:F,2,0),\"\")","v":""},{"$f":"IFERROR(VLOOKUP($D196,prezence!A:F,3,0),\"\")","v":""},{"$f":"IFERROR(VLOOKUP($D196,prezence!A:F,4,0),\"\")","v":""}]
[196,{"$f":"výsledky!B201","v":"00:00:00"},{"$f":"výsledky!C201","v":-0.011921296296296298},{"$f":"výsledky!D201","v":0},{"$f":"IFERROR(VLOOKUP($D197,prezence!A:F,2,0),\"\")","v":""},{"$f":"IFERROR(VLOOKUP($D197,prezence!A:F,3,0),\"\")","v":""},{"$f":"IFERROR(VLOOKUP($D197,prezence!A:F,4,0),\"\")","v":""}]
[197,{"$f":"výsledky!B202","v":"00:00:00"},{"$f":"výsledky!C202","v":-0.011921296296296298},{"$f":"výsledky!D202","v":0},{"$f":"IFERROR(VLOOKUP($D198,prezence!A:F,2,0),\"\")","v":""},{"$f":"IFERROR(VLOOKUP($D198,prezence!A:F,3,0),\"\")","v":""},{"$f":"IFERROR(VLOOKUP($D198,prezence!A:F,4,0),\"\")","v":""}]
[198,{"$f":"výsledky!B203","v":"00:00:00"},{"$f":"výsledky!C203","v":-0.011921296296296298},{"$f":"výsledky!D203","v":0},{"$f":"IFERROR(VLOOKUP($D199,prezence!A:F,2,0),\"\")","v":""},{"$f":"IFERROR(VLOOKUP($D199,prezence!A:F,3,0),\"\")","v":""},{"$f":"IFERROR(VLOOKUP($D199,prezence!A:F,4,0),\"\")","v":""}]
[199,{"$f":"výsledky!B204","v":"00:00:00"},{"$f":"výsledky!C204","v":-0.011921296296296298},{"$f":"výsledky!D204","v":0},{"$f":"IFERROR(VLOOKUP($D200,prezence!A:F,2,0),\"\")","v":""},{"$f":"IFERROR(VLOOKUP($D200,prezence!A:F,3,0),\"\")","v":""},{"$f":"IFERROR(VLOOKUP($D200,prezence!A:F,4,0),\"\")","v":""}]
[200,{"$f":"výsledky!B205","v":"00:00:00"},{"$f":"výsledky!C205","v":-0.011921296296296298},{"$f":"výsledky!D205","v":0},{"$f":"IFERROR(VLOOKUP($D201,prezence!A:F,2,0),\"\")","v":""},{"$f":"IFERROR(VLOOKUP($D201,prezence!A:F,3,0),\"\")","v":""},{"$f":"IFERROR(VLOOKUP($D201,prezence!A:F,4,0),\"\")","v":""}]